Mago Tests Report

This are the results from a run of Mago Desktop Tests. If you find false positives, please, report bugs against Mago project.

Suite
test_sanitycheck
Class
Description
TestCase NameDescriptionMethodStatusTime Elapsed (s)MessageScreenshotStacktrace
test_gnomeabout_basictest_sanitycheck.TestAboutgnome.test_gnomeabout_basic"TestAboutgnome.test_gnomeabout_basic"Passed17.50
test_gnomeaboutme_basictest_sanitycheck.TestAboutme.test_gnomeaboutme_basic"TestAboutme.test_gnomeaboutme_basic"Passed18.00
test_yelp_basictest_sanitycheck.TestAboutubuntu.test_yelp_basic"TestAboutubuntu.test_yelp_basic"Passed77.00
test_accerciser_basictest_sanitycheck.TestAccerciser.test_accerciser_basic"TestAccerciser.test_accerciser_basic"Passed19.00
test_jockeygtk_basictest_sanitycheck.TestAdditionaldrivers.test_jockeygtk_basic"TestAdditionaldrivers.test_jockeygtk_basic"Passed26.00
test_sol_basictest_sanitycheck.TestAisleriotsolitaire.test_sol_basic"TestAisleriotsolitaire.test_sol_basic"Passed18.00
test_antspotlight_basictest_sanitycheck.TestAntspotlight.test_antspotlight_basic"TestAntspotlight.test_antspotlight_basic"Passed158.00
test_gnomeappearanceproperties_basictest_sanitycheck.TestAppearance.test_gnomeappearanceproperties_basic"TestAppearance.test_gnomeappearanceproperties_basic"Passed17.00
test_fileroller_basictest_sanitycheck.TestArchivemanager.test_fileroller_basic"TestArchivemanager.test_fileroller_basic"Passed18.00
test_gnomeatproperties_basictest_sanitycheck.TestAssistivetechnologies.test_gnomeatproperties_basic"TestAssistivetechnologies.test_gnomeatproperties_basic"Passed15.00
test_banshee1_basictest_sanitycheck.TestBansheemediaplayer.test_banshee1_basic"TestBansheemediaplayer.test_banshee1_basic"Passed24.00
test_bluetoothproperties_basictest_sanitycheck.TestBluetooth.test_bluetoothproperties_basic"TestBluetooth.test_bluetoothproperties_basic"Passed18.00
test_brasero_basictest_sanitycheck.TestBrasero.test_brasero_basic"TestBrasero.test_brasero_basic"Passed20.00
test_gcalctool_basictest_sanitycheck.TestCalculator.test_gcalctool_basic"TestCalculator.test_gcalctool_basic"Passed20.00
test_nautilus_basictest_sanitycheck.TestCddvdcreator.test_nautilus_basic"TestCddvdcreator.test_nautilus_basic"Passed96.00
test_gucharmap_basictest_sanitycheck.TestCharactermap.test_gucharmap_basic"TestCharactermap.test_gucharmap_basic"Passed16.00
test_chromiumbrowser_basictest_sanitycheck.TestChromiumwebbrowser.test_chromiumbrowser_basic"TestChromiumwebbrowser.test_chromiumbrowser_basic"Passed20.00
test_ccsm_basictest_sanitycheck.TestCompizconfigsettingsmanager.test_ccsm_basic"TestCompizconfigsettingsmanager.test_ccsm_basic"Passed19.00
test_computerjanitorgtk_basictest_sanitycheck.TestComputerjanitor.test_computerjanitorgtk_basic"TestComputerjanitor.test_computerjanitorgtk_basic"Passed18.00
test_gconfeditor_basictest_sanitycheck.TestConfigurationeditor.test_gconfeditor_basic"TestConfigurationeditor.test_gconfeditor_basic"Passed18.00
test_gnomecontrolcenter_basictest_sanitycheck.TestControlcenter.test_gnomecontrolcenter_basic"TestControlcenter.test_gnomecontrolcenter_basic"Passed19.00
test_slideshow_basictest_sanitycheck.TestCosmos.test_slideshow_basic"TestCosmos.test_slideshow_basic"Passed18.00
test_devhelp_basictest_sanitycheck.TestDevhelp.test_devhelp_basic"TestDevhelp.test_devhelp_basic"Passed19.00
test_dfeet_basictest_sanitycheck.TestDfeet.test_dfeet_basic"TestDfeet.test_dfeet_basic"Passed18.00
test_baobab_basictest_sanitycheck.TestDiskusageanalyzer.test_baobab_basic"TestDiskusageanalyzer.test_baobab_basic"Passed18.00
test_palimpsest_basictest_sanitycheck.TestDiskutility.test_palimpsest_basic"TestDiskutility.test_palimpsest_basic"Passed18.00
test_evince_basictest_sanitycheck.TestDocumentviewer.test_evince_basic"TestDocumentviewer.test_evince_basic"Passed18.00
test_evolutionsettings_basictest_sanitycheck.TestEmailsettings.test_evolutionsettings_basic"TestEmailsettings.test_evolutionsettings_basic"Passed19.00
test_empathy_basictest_sanitycheck.TestEmpathy.test_empathy_basic"TestEmpathy.test_empathy_basic"Passed18.00
test_seahorsepreferences_basictest_sanitycheck.TestEncryptionandkeyrings.test_seahorsepreferences_basic"TestEncryptionandkeyrings.test_seahorsepreferences_basic"Passed18.00
test_evolution_basictest_sanitycheck.TestEvolution.test_evolution_basic"TestEvolution.test_evolution_basic"Passed25.00
test_fiberlamp_basictest_sanitycheck.TestFiberlamp.test_fiberlamp_basic"TestFiberlamp.test_fiberlamp_basic"Passed136.00
test_nautilusfilemanagementproperties_basictest_sanitycheck.TestFilemanagement.test_nautilusfilemanagementproperties_basic"TestFilemanagement.test_nautilusfilemanagementproperties_basic"Passed18.00
test_firefox_basictest_sanitycheck.TestFirefox40beta9webbrowser.test_firefox_basic"TestFirefox40beta9webbrowser.test_firefox_basic"Passed22.00
test_floaters_basictest_sanitycheck.TestFloatingfeet.test_floaters_basic"TestFloatingfeet.test_floaters_basic"Passed158.00
test_floaters_basictest_sanitycheck.TestFloatingubuntu.test_floaters_basic"TestFloatingubuntu.test_floaters_basic"Test Failed0.11'Text attachment: traceback
------------
Traceback (most recent call last):
 File "/usr/lib/python2.7/dist-packages/testtools/runtest.py", line 169, in _run_user
 return fn(*args, **kwargs)
 File "/usr/lib/python2.7/dist-packages/testtools/testcase.py", line 459, in _run_setup
 ret = self.setUp()
 File "/home/j-lallement/Unity/DesktopTesting/mago-2.0/mago/case.py", line 82, in setUp
 TestApplication(self.launcher, window_name = self.window_name)
 File "/home/j-lallement/Unity/DesktopTesting/mago-2.0/mago/application.py", line 71, in __init__
 self.launch()
 File "/home/j-lallement/Unity/DesktopTesting/mago-2.0/mago/application.py", line 94, in launch
 self.pid = ldtp.launchapp(launcher, launcher_args)
 File "/usr/lib/python2.7/dist-packages/ldtp/client.py", line 50, in __call__
 File "/usr/lib/python2.7/xmlrpclib.py", line 1575, in __request
 verbose=self.__verbose
 File "/usr/lib/python2.7/dist-packages/ldtp/client.py", line 99, in request
LdtpExecutionError: [Errno 2] No such file or directory
------------
' [Show/Hide Stacktrace]
test_fuzzyflakes_basictest_sanitycheck.TestFuzzyflakes.test_fuzzyflakes_basic"TestFuzzyflakes.test_fuzzyflakes_basic"Passed157.89
test_gbrainy_basictest_sanitycheck.TestGbrainy.test_gbrainy_basic"TestGbrainy.test_gbrainy_basic"Passed19.00
test_gedit_basictest_sanitycheck.TestGedit.test_gedit_basic"TestGedit.test_gedit_basic"Passed19.00
test_glade3_basictest_sanitycheck.TestGlade.test_glade3_basic"TestGlade.test_glade3_basic"Passed80.00
test_glblur_basictest_sanitycheck.TestGlblur.test_glblur_basic"TestGlblur.test_glblur_basic"Passed155.00
test_glcells_basictest_sanitycheck.TestGlcells.test_glcells_basic"TestGlcells.test_glcells_basic"Passed154.00
test_glmatrix_basictest_sanitycheck.TestGlmatrix.test_glmatrix_basic"TestGlmatrix.test_glmatrix_basic"Passed157.00
test_glschool_basictest_sanitycheck.TestGlschool.test_glschool_basic"TestGlschool.test_glschool_basic"Passed155.00
test_glslideshow_basictest_sanitycheck.TestGlslideshow.test_glslideshow_basic"TestGlslideshow.test_glslideshow_basic"Passed154.00
test_gltext_basictest_sanitycheck.TestGltext.test_gltext_basic"TestGltext.test_gltext_basic"Passed158.00
test_gobby_basictest_sanitycheck.TestGobbycollaborativeeditor04.test_gobby_basic"TestGobbycollaborativeeditor04.test_gobby_basic"Passed22.98
test_gvim_basictest_sanitycheck.TestGvimtexteditor.test_gvim_basic"TestGvimtexteditor.test_gvim_basic"Passed76.00
test_hypertorus_basictest_sanitycheck.TestHypertorus.test_hypertorus_basic"TestHypertorus.test_hypertorus_basic"Passed157.00
test_eog_basictest_sanitycheck.TestImageviewer.test_eog_basic"TestImageviewer.test_eog_basic"Passed19.00
test_imswitch_basictest_sanitycheck.TestInputmethodswitcher.test_imswitch_basic"TestInputmethodswitcher.test_imswitch_basic"Passed18.00
test_gnomekeyboardproperties_basictest_sanitycheck.TestKeyboard.test_gnomekeyboardproperties_basic"TestKeyboard.test_gnomekeyboardproperties_basic"Passed16.00
test_ibussetup_basictest_sanitycheck.TestKeyboardinputmethods.test_ibussetup_basic"TestKeyboardinputmethods.test_ibussetup_basic"Passed21.00
test_gnomekeybindingproperties_basictest_sanitycheck.TestKeyboardshortcuts.test_gnomekeybindingproperties_basic"TestKeyboardshortcuts.test_gnomekeybindingproperties_basic"Passed17.00
test_knetattach_basictest_sanitycheck.TestKnetattach.test_knetattach_basic"TestKnetattach.test_knetattach_basic"Test Failed0.11'Text attachment: traceback
------------
Traceback (most recent call last):
 File "/usr/lib/python2.7/dist-packages/testtools/runtest.py", line 169, in _run_user
 return fn(*args, **kwargs)
 File "/usr/lib/python2.7/dist-packages/testtools/testcase.py", line 459, in _run_setup
 ret = self.setUp()
 File "/home/j-lallement/Unity/DesktopTesting/mago-2.0/mago/case.py", line 82, in setUp
 TestApplication(self.launcher, window_name = self.window_name)
 File "/home/j-lallement/Unity/DesktopTesting/mago-2.0/mago/application.py", line 71, in __init__
 self.launch()
 File "/home/j-lallement/Unity/DesktopTesting/mago-2.0/mago/application.py", line 94, in launch
 self.pid = ldtp.launchapp(launcher, launcher_args)
 File "/usr/lib/python2.7/dist-packages/ldtp/client.py", line 50, in __call__
 File "/usr/lib/python2.7/xmlrpclib.py", line 1575, in __request
 verbose=self.__verbose
 File "/usr/lib/python2.7/dist-packages/ldtp/client.py", line 99, in request
LdtpExecutionError: [Errno 2] No such file or directory
------------
' [Show/Hide Stacktrace]
test_liferea_basictest_sanitycheck.TestLifereafeedreader.test_liferea_basic"TestLifereafeedreader.test_liferea_basic"Passed34.89
test_gnomesystemlog_basictest_sanitycheck.TestLogfileviewer.test_gnomesystemlog_basic"TestLogfileviewer.test_gnomesystemlog_basic"Passed123.00
test_gdmsetup_basictest_sanitycheck.TestLoginscreen.test_gdmsetup_basic"TestLoginscreen.test_gdmsetup_basic"Passed18.00
test_mahjongg_basictest_sanitycheck.TestMahjongg.test_mahjongg_basic"TestMahjongg.test_mahjongg_basic"Passed18.00
test_alacarte_basictest_sanitycheck.TestMainmenu.test_alacarte_basic"TestMainmenu.test_alacarte_basic"Passed22.00
test_systemconfigprinterapplet_basictest_sanitycheck.TestManageprintjobs.test_systemconfigprinterapplet_basic"TestManageprintjobs.test_systemconfigprinterapplet_basic"Passed157.00
test_empathyaccounts_basictest_sanitycheck.TestMessagingandvoipaccounts.test_empathyaccounts_basic"TestMessagingandvoipaccounts.test_empathyaccounts_basic"Passed20.00
test_gnomine_basictest_sanitycheck.TestMines.test_gnomine_basic"TestMines.test_gnomine_basic"Passed18.00
test_gnomedisplayproperties_basictest_sanitycheck.TestMonitors.test_gnomedisplayproperties_basic"TestMonitors.test_gnomedisplayproperties_basic"Passed18.00
test_gnomemouseproperties_basictest_sanitycheck.TestMouse.test_gnomemouseproperties_basic"TestMouse.test_gnomemouseproperties_basic"Passed18.00
test_totem_basictest_sanitycheck.TestMovieplayer.test_totem_basic"TestMovieplayer.test_totem_basic"Passed22.00
test_gstreamerproperties_basictest_sanitycheck.TestMultimediasystemsselector.test_gstreamerproperties_basic"TestMultimediasystemsselector.test_gstreamerproperties_basic"Passed18.00
test_nmconnectioneditor_basictest_sanitycheck.TestNetworkconnections.test_nmconnectioneditor_basic"TestNetworkconnections.test_nmconnectioneditor_basic"Passed18.00
test_gnomenetworkproperties_basictest_sanitycheck.TestNetworkproxy.test_gnomenetworkproperties_basic"TestNetworkproxy.test_gnomenetworkproperties_basic"Passed19.00
test_gnomenettool_basictest_sanitycheck.TestNetworktools.test_gnomenettool_basic"TestNetworktools.test_gnomenettool_basic"Passed18.00
test_onboard_basictest_sanitycheck.TestOnboard.test_onboard_basic"TestOnboard.test_onboard_basic"Passed19.00
test_onboardsettings_basictest_sanitycheck.TestOnboardsettings.test_onboardsettings_basic"TestOnboardsettings.test_onboardsettings_basic"Passed19.00
test_ooffice_basictest_sanitycheck.TestOpenofficeorgspreadsheet.test_ooffice_basic"TestOpenofficeorgspreadsheet.test_ooffice_basic"Passed25.00
test_orca_basictest_sanitycheck.TestOrca.test_orca_basic"TestOrca.test_orca_basic"Passed23.00
test_seahorse_basictest_sanitycheck.TestPasswordsandencryptionkeys.test_seahorse_basic"TestPasswordsandencryptionkeys.test_seahorse_basic"Passed21.00
test_pitivi_basictest_sanitycheck.TestPitivivideoeditor.test_pitivi_basic"TestPitivivideoeditor.test_pitivi_basic"Passed20.00
test_gnomepowerpreferences_basictest_sanitycheck.TestPowermanagement.test_gnomepowerpreferences_basic"TestPowermanagement.test_gnomepowerpreferences_basic"Passed18.00
test_gnomedefaultapplicationsproperties_basictest_sanitycheck.TestPreferredapplications.test_gnomedefaultapplicationsproperties_basic"TestPreferredapplications.test_gnomedefaultapplicationsproperties_basic"Passed18.00
test_systemconfigprinter_basictest_sanitycheck.TestPrinting.test_systemconfigprinter_basic"TestPrinting.test_systemconfigprinter_basic"Passed19.00
test_quadrapassel_basictest_sanitycheck.TestQuadrapassel.test_quadrapassel_basic"TestQuadrapassel.test_quadrapassel_basic"Passed19.00
test_wish_basictest_sanitycheck.TestReactivatehplaserjet10181020afterreloadingpaper.test_wish_basic"TestReactivatehplaserjet10181020afterreloadingpaper.test_wish_basic"Test Failed0.05'Text attachment: traceback
------------
Traceback (most recent call last):
 File "/usr/lib/python2.7/dist-packages/testtools/runtest.py", line 169, in _run_user
 return fn(*args, **kwargs)
 File "/usr/lib/python2.7/dist-packages/testtools/testcase.py", line 459, in _run_setup
 ret = self.setUp()
 File "/home/j-lallement/Unity/DesktopTesting/mago-2.0/mago/case.py", line 82, in setUp
 TestApplication(self.launcher, window_name = self.window_name)
 File "/home/j-lallement/Unity/DesktopTesting/mago-2.0/mago/application.py", line 71, in __init__
 self.launch()
 File "/home/j-lallement/Unity/DesktopTesting/mago-2.0/mago/application.py", line 94, in launch
 self.pid = ldtp.launchapp(launcher, launcher_args)
 File "/usr/lib/python2.7/dist-packages/ldtp/client.py", line 50, in __call__
 File "/usr/lib/python2.7/xmlrpclib.py", line 1575, in __request
 verbose=self.__verbose
 File "/usr/lib/python2.7/dist-packages/ldtp/client.py", line 99, in request
LdtpExecutionError: [Errno 2] No such file or directory
------------
' [Show/Hide Stacktrace]
test_vinopreferences_basictest_sanitycheck.TestRemotedesktop.test_vinopreferences_basic"TestRemotedesktop.test_vinopreferences_basic"Passed17.95
test_vinagre_basictest_sanitycheck.TestRemotedesktopviewer.test_vinagre_basic"TestRemotedesktopviewer.test_vinagre_basic"Passed18.00
test_rhythmboxclient_basictest_sanitycheck.TestRhythmbox.test_rhythmboxclient_basic"TestRhythmbox.test_rhythmboxclient_basic"Passed22.00
test_gksu_basictest_sanitycheck.TestRootterminal.test_gksu_basic"TestRootterminal.test_gksu_basic"Passed18.00
test_gnomescreensaverpreferences_basictest_sanitycheck.TestScreensaver.test_gnomescreensaverpreferences_basic"TestScreensaver.test_gnomescreensaverpreferences_basic"Passed18.00
test_gnomesearchtool_basictest_sanitycheck.TestSearchforfiles.test_gnomesearchtool_basic"TestSearchforfiles.test_gnomesearchtool_basic"Passed19.00
test_shotwell_basictest_sanitycheck.TestShotwellphotomanager.test_shotwell_basic"TestShotwellphotomanager.test_shotwell_basic"Passed19.00
test_simplescan_basictest_sanitycheck.TestSimplescan.test_simplescan_basic"TestSimplescan.test_simplescan_basic"Passed18.00
test_gnomevolumecontrol_basictest_sanitycheck.TestSound.test_gnomevolumecontrol_basic"TestSound.test_gnomevolumecontrol_basic"Passed17.00
test_gnomesoundrecorder_basictest_sanitycheck.TestSoundrecorder.test_gnomesoundrecorder_basic"TestSoundrecorder.test_gnomesoundrecorder_basic"Passed18.00
test_gnomesessionproperties_basictest_sanitycheck.TestStartupapplications.test_gnomesessionproperties_basic"TestStartupapplications.test_gnomesessionproperties_basic"Passed17.00
test_usbcreatorgtk_basictest_sanitycheck.TestStartupdiskcreator.test_usbcreatorgtk_basic"TestStartupdiskcreator.test_usbcreatorgtk_basic"Passed19.00
test_gnomesudoku_basictest_sanitycheck.TestSudoku.test_gnomesudoku_basic"TestSudoku.test_gnomesudoku_basic"Passed19.00
test_synaptic_basictest_sanitycheck.TestSynapticpackagemanager.test_synaptic_basic"TestSynapticpackagemanager.test_synaptic_basic"Passed18.00
test_gnomesystemmonitor_basictest_sanitycheck.TestSystemmonitor.test_gnomesystemmonitor_basic"TestSystemmonitor.test_gnomesystemmonitor_basic"Passed18.00
test_checkboxgtk_basictest_sanitycheck.TestSystemtesting.test_checkboxgtk_basic"TestSystemtesting.test_checkboxgtk_basic"Passed21.00
test_gnomescreenshot_basictest_sanitycheck.TestTakescreenshot.test_gnomescreenshot_basic"TestTakescreenshot.test_gnomescreenshot_basic"Passed19.00
test_tsclient_basictest_sanitycheck.TestTerminalserverclient.test_tsclient_basic"TestTerminalserverclient.test_tsclient_basic"Passed18.00
test_thunderbird_basictest_sanitycheck.TestThunderbirdmailnews.test_thunderbird_basic"TestThunderbirdmailnews.test_thunderbird_basic"Passed23.00
test_tomboy_basictest_sanitycheck.TestTomboynotes.test_tomboy_basic"TestTomboynotes.test_tomboy_basic"Passed79.00
test_transmissiongtk_basictest_sanitycheck.TestTransmission.test_transmissiongtk_basic"TestTransmission.test_transmissiongtk_basic"Passed18.00
test_softwarecenter_basictest_sanitycheck.TestUbuntusoftwarecenter.test_softwarecenter_basic"TestUbuntusoftwarecenter.test_softwarecenter_basic"Passed29.00
test_updatemanager_basictest_sanitycheck.TestUpdatemanager.test_updatemanager_basic"TestUpdatemanager.test_updatemanager_basic"Passed26.00
test_gnomewindowproperties_basictest_sanitycheck.TestWindows.test_gnomewindowproperties_basic"TestWindows.test_gnomewindowproperties_basic"Passed18.00
test_xchatgnome_basictest_sanitycheck.TestXchatgnome.test_xchatgnome_basic"TestXchatgnome.test_xchatgnome_basic"Passed77.00
test_xchat_basictest_sanitycheck.TestXchatirc.test_xchat_basic"TestXchatirc.test_xchat_basic"Passed18.00