Ubuntu bug reports with the greatest number of duplicates.

All of the column headers are sortable give them a click!

SummaryInImportanceStatusNumber of duplicatesPrivate
807950zeitgeist-daemon crashed with LookupError in remove_from_connection(): <_zeitgeist.engine.remote.RemoteInterface at /org/gnome/zeitgeist/log/activity at 0xb74ee2cc> is not exported at a location matching (None,None)zeitgeistHighTriaged635No
626798update-manager crashed with DBusException in _run()policykitHighConfirmed540No
349469debconf: DbDriver "config": /var/cache/debconf/config.dat is locked by another process: Resource temporarily unavailabledebconfMediumTriaged458No
507062synaptic assert failure: synaptic: ../../src/xcb_io.c:385: _XAllocID: Assertion `ret != inval_id' failed.libx11MediumTriaged355No
545790package PACKAGE failed to install/upgrade: error writing to '': SuccessdpkgHighTriaged332No
576648package nvidia-* failed to install/upgrade: nvidia-* kernel module failed to build (Unable to determine the target kernel version.)nvidia-graphics-drivers-updatesUndecidedTriaged265No
576648package nvidia-* failed to install/upgrade: nvidia-* kernel module failed to build (Unable to determine the target kernel version.)nvidia-graphics-driversHighTriaged265No
576648package nvidia-* failed to install/upgrade: nvidia-* kernel module failed to build (Unable to determine the target kernel version.)nvidia-graphics-drivers-96HighTriaged265No
484499[MASTER] syntax errors in /etc/default/grub break upgradesgrub2MediumTriaged216No
338217scim-bridge crashed with SIGSEGV in scim::Module::unload() - fixed by "rm -Rf ~/.scim/"scim-bridgeMediumConfirmed215No
700036package blcr-dkms 0.8.2-15ubuntu1 failed to install/upgrade: blcr kernel module failed to build - error: ‘struct signal_struct’ has no member named ‘count’blcrHighIn Progress196No
854090aptd crashed with SIGSEGV in debListParser::LoadReleaseInfo()aptHighConfirmed195No
905686nautilus assert failure: nautilus: ../../src/xcb_io.c:528: _XAllocID: Assertion `ret != inval_id' failed.libx11HighTriaged194No
905686nautilus assert failure: nautilus: ../../src/xcb_io.c:528: _XAllocID: Assertion `ret != inval_id' failed.nautilusMediumConfirmed194No
943046ubuntu-sso-login crashed with SIGSEGV in QSocketNotifier::setEnabled()ubuntu-sso-clientHighConfirmed187No
635893update-apt-xapian-index crashed with OverflowError in index()apt-xapian-indexUndecidedConfirmed176No
243344scim-bridge crashed with SIGSEGV in scim::IMEngineInstanceBase::get_frontend_data()scim-bridgeHighConfirmed168No
940632package zoneminder 1.25.0-1 failed to install/upgrade: subprocess installed post-installation script returned error exit status 1 [ERROR 1142 (42000) at line 10: CREATE command denied to user 'zmuser'@'localhost']zoneminderUndecidedConfirmed148No
418300gdu-notification-daemon crashed with SIGSEGV in gdu_pool_get_devices()gnome-disk-utilityMediumTriaged139No
439448Visual corruption affecting several panel appletsgnome-panelMediumTriaged134No
511463grub-pc failed to install/upgrade: exit status 1 - frontend: Fatal IO error 11 (Resource temporarily unavailable) on X server :0.0.grub2MediumConfirmed134No
807129ClockScreenlet.py crashed with GError in load_buttons(): Icon 'gtk-close' not present in themeindiv-screenletsMediumConfirmed120No
420705ubuntuone-syncdaemon crashed with DBusException in __new__()ubuntuone-clientHighTriaged119No
746949package halevt 0.1.6.2-1.3 failed to install/upgrade: ErrorMessage: subprocess installed post-installation script returned error exit status 100halevtMediumConfirmed111No
711397package firmware-b43legacy-installer 4.178.10.4-5 failed to install/upgrade due to unsupported hardwareb43-fwcutterMediumTriaged109No
523896useradd: cannot lock /etc/passwd; try again later.shadowHighTriaged109No
284912[Radio] RadioScreenlet.py crashed with AttributeError in sys_get_window_manager()screenletsMediumTriaged109No
691985lzma: Encoder error: -2147467259 is too vague and causes unhelpful apport-package reportslzmaMediumTriaged107No
412325[MASTER] multiple failures on evolution-data-server-2.28 and gconfevolution-data-serverMediumTriaged99No
182629gksu crashed with SIGSEGV in gdk_window_set_opacity()gksuHighTriaged96No
948667gnome-panel crashed with SIGSEGV in gtk_widget_pop_verify_invariants()gnome-panelHighConfirmed95No
386763[Master] font package failed to install/upgrade: post-installation exit status 1 - /var/lib/defoma/locked exists.defomaLowTriaged93No
541492MASTER: [i845] GPU lockupxserver-xorg-video-intelWishlistTriaged93No
804943blcr kernel module failed to build with kernel 3.0 : configure: error: --with-linux argument '3.0-x' is neither a kernel version string nor a full pathblcrHighTriaged92No
647802amdcccle crashed with SIGSEGVfglrx-installerMediumConfirmed87No
423817brcupsconfpt1 assert failure: *** buffer overflow detected ***: /usr/Brother/Printer/dcp560cn/cupswrapper/brcupsconfpt1 terminatedbrother-cups-wrapper-commonHighTriaged85No
754562soffice.bin crashed with SIGSEGV in g_hash_table_lookup() (Libreoffice with lo-menubar crash from page preview)lo-menubarMediumTriaged83No
459898software-center crashed with DBusException in call_blocking()software-centerMediumConfirmed83No
840392colord crashed with SIGSEGVcolordMediumConfirmed83No
722897telepathy-butterfly crashed with KeyError in disconnected(): telepathy-butterflyMediumTriaged82No
741425polkit-gnome-authentication-agent-1 crashed with SIGABRT in raise()policykit-1-gnomeMediumConfirmed80No
601407package linux-image-2.6.32-23-generic 2.6.32-23.37 failed to install/upgrade: run-parts: /etc/kernel/postinst.d/nvidia-common exited with return code 10nvidia-commonHighTriaged79No
264336pgsql fails to start due to shared buffer setting greater than kernel allowspostgresql-8.4UndecidedConfirmed78No
561125WARNING: at /build/buildd/linux-2.6.32/kernel/softirq.c:143 local_bh_enable_ip+0x61/0x90() [ath9k]linuxUndecidedConfirmed77No
852343gtk-logout-helper crashed with signal 5 in __libc_start_main()indicator-sessionLowConfirmed74No
628429package python-openssl (not installed) failed to install/upgrade: ErrorMessage: Kein Paket namens »python-openssl« ist installiert, kann nicht konfigurierenpyopensslUndecidedConfirmed73No
877852samba failed to install when updating from ubuntu 11.04 to 11.10sambaMediumConfirmed73No
420088synergys assert failure: synergys: CArchMultithreadPosix.cpp:286: virtual void CArchMultithreadPosix::closeMutex(CArchMutexImpl*): Assertion `status == 0' failed.synergyMediumConfirmed71No
697095polkit-gnome-authentication-agent-1 crashed with SIGSEGV in g_datalist_id_set_data_full() during logoutpolicykit-1-gnomeLowIn Progress69No
141613npviewer.bin crashed with SIGSEGVnspluginwrapperHighConfirmed69No
363313error on install/upgrade: (EE) Not supported linux systemuserful-multiplierHighTriaged68No
936560unity-2d-shell crashed with SIGSEGVunity-2dMediumConfirmed68No
943880Xorg crashed with SIGABRT in __libc_message() from malloc_printerr() via XIDestroyDevicePropertyxorg-serverHighConfirmed67No
328089splashy 0.3.13-3ubuntu1 fresh install conflicts with lsb-basesplashyHighTriaged67No
312491Out-of-disk-space is not reported to the user when installing/updating packages failssynapticUndecidedConfirmed67No
541511MASTER: [i855] GPU lockup (apport-crash)linuxUndecidedConfirmed66No
541511MASTER: [i855] GPU lockup (apport-crash)xserver-xorg-video-intelWishlistTriaged66No
516826ntfs-config crashed with AttributeError in add_section()ntfs-configMediumTriaged65No
628104update-manager crashes: AptDaemonError: org.debian.apt: Could not cancel transactionupdate-managerHighTriaged65No
601447package fglrx 2:8.723.1-0ubuntu4 failed to install/upgrade: fglrx kernel module failed to build [Error: kernel includes at ... do not match current kernel. they are versioned as "" instead of "2.6.32-23-generic". you might need to adjust your symlinks: ...]fglrx-installerHighConfirmed65No
341503update-manager crashed with SystemError in requiredDownload()update-managerHighTriaged64No
747183indicator-weather assert failure: *** glibc detected *** /usr/bin/python: free(): invalid pointer: 0xb70f8a08 ***indicator-weatherMediumConfirmed63No
408719KIO scheduler crashes at exit if VLC file open dialog is usedqt4-x11UndecidedConfirmed63No
942886package fgfs-base 2.4.0-1 failed to install/upgrade: subprocess installed post-installation script returned error exit status 1fgfs-baseUndecidedConfirmed60No
708888simple-ccsm crashed with AttributeError in FillAnimationBoxes(): 'compizconfig.Plugin' object has no attribute 'Screens'simple-ccsmLowNew59No
828850software-properties-gtk crashed with DBusException in call_blocking(): com.ubuntu.SoftwareProperties.PermissionDeniedByPolicy: com.ubuntu.softwareproperties.applychangessoftware-propertiesMediumTriaged59No
207958gnome-panel crashed with SIGSEGV in ORBit_c_stub_invoke()gnome-panelMediumTriaged58No
949641Installing both fglrx and fglrx-updates results in: error exit status 1 -"/etc/init.d/atieventsd exists during rc.d purge"fglrx-installerCriticalTriaged55No
827934colord crashed with SIGABRT in raise()colordHighConfirmed55No
711413ubuntu-sso-login crashed with DBusException in __new__(): org.freedesktop.DBus.Error.NoServer: Failed to connect to socket /tmp/dbus-zPW5jjeWfI: Connection refusedubuntu-sso-clientHighNew54No
765397indicator-weather assert failure: *** glibc detected *** /usr/bin/python: realloc(): invalid pointer: 0x08d86650 ***indicator-weatherMediumConfirmed54No
851532gnome-panel crashed with SIGSEGV in gtk_container_forall()gnome-panelHighTriaged54No
276503package ubuntustudio-menu 0.10 failed to install/upgrade: there is no script in the new version of the package - giving upubuntustudio-menuHighTriaged54No
711221ubuntuone-syncdaemon crashed with DBusException in call_blocking(): org.freedesktop.DBus.Error.Disconnected: Connection was disconnected before a reply was receivedubuntuone-clientHighConfirmed54No
321091Bacula fails to install correctly if mysql wasn't installed beforebaculaMediumConfirmed53No
86767[apport] gnome-vfs-daemon crashed with SIGSEGV in _gnome_vfs_handle_do_close()gnome-vfs2LowTriaged52No
708517plymouthd assert failure: plymouthd: ./plugin.c:540: map_to_device: Assertion `head->size > 0' failed.plymouthHighTriaged52No
733453plymouthd crashed with SIGSEGV in script_obj_deref_direct()plymouthHighConfirmed51No
758821freevo.real crashed with IOError in __main__: [Errno 2] No such file or directory: '/usr/lib/pymodules/python2.5/freevo/version.py'freevoMediumConfirmed51No
818987nautilus-actions-config-tool crashed with signal 5 in g_option_context_parse()nautilus-actionsMediumConfirmed51No
978591soffice.bin crashed with SIGSEGV in SfxItemSet::~SfxItemSet()lo-menubarHighConfirmed51No
918744telepathy-idle crashed with SIGSEGV in g_io_stream_get_output_stream()telepathy-idleHighConfirmed51No
907568software-center crashed with SIGSEGV in PyGILState_Ensure()pygobjectHighConfirmed51No
924612gnome-settings-daemon SIGABRT when gnome-session goes downgnome-settings-daemonLowConfirmed50No
718337package swfdec-mozilla 0.6.0-2ubuntu1 failed to install/upgrade: subproces installed pre-removal script gaf een foutwaarde 2 terugswfdec-mozillaUndecidedNew50No
616107update-manager crashed with TransactionFailed in _run()update-managerMediumTriaged49No
275659jockey-gtk crashed with DBusException in call_blocking() ("Activation of com.ubuntu.DeviceDriver timed out")jockeyUndecidedTriaged48No
386042package linux-image-2.6.28-13-generic 2.6.28-13.44 failed to install/upgrade: subprocess post-installation script returned error exit status 1grubMediumConfirmed48No
833348[MASTER] ccsm crashed with KeyError in compizconfig.Plugin.ApplyStringExtensions (src/compizconfig.c:6780)(): 'h\xf5p\n\x01'compizconfig-settings-managerHighTriaged48No
739194WARNING: at /build/buildd/linux-2.6.38/kernel/power/suspend_test.c:53 suspend_test_finish+0x86/0x90()linuxUndecidedConfirmed46No
991282package linux-image-3.2.0-24-generic 3.2.0-24.37 failed to install/upgrade: run-parts: /etc/kernel/postinst.d/initramfs-tools exited with return code 1initramfs-toolsHighConfirmed46No
984276installing casper on a non live system causes update-initramfs to failcasperMediumConfirmed45No
571999package wine1.2 (not installed) failed to install/upgrade when both wine and wine1.2 are installedaptLowConfirmed45No
629112update-apt-xapian-index crashed with DatabaseError in buildIndex()apt-xapian-indexMediumTriaged44No
263099totem-gstreamer-video-indexer crashed with SIGSEGV in g_object_notify()gstreamer0.10MediumTriaged44No
258603ubiquity crashed with InstallStepError in configure_user()ubiquityUndecidedConfirmed44No
403361apport-kde crashed with SIGSEGV in QWidgetPrivate::deleteExtra()python-qt4HighTriaged44No
762996package blcr-dkms 0.8.2-10 failed to install/upgrade: blcr kernel module failed to build [configure: error: Failed to locate kernel symbol table. Try using --with-system-map or --with-vmlinux.]blcrMediumConfirmed43No
399937ubuntuone-syncdaemon crashed with ImportError: No module named twisted.internetubuntuone-clientMediumConfirmed43No
991792package keyboard-configuration 1.70ubuntu5 failed to install/upgrade: ErrorMessage: subprocess installed post-installation script returned error exit status 10console-setupUndecidedConfirmed43No
908380[ipw2200] nm-applet crashed with SIGABRT in g_assertion_message()linuxHighTriaged42No
721306[MASTER] Can't upgrade from 10.04LTS to 10.10 - E:Error, pkgProblemResolver::Resolve generated breaks - xorg-xserver-video-nouveauupdate-managerHighTriaged42No
844286colord crashed with SIGSEGV in dbus_message_get_reply_serial()colordMediumConfirmed42No
652916wrong bug duplication - ubiquity-dm crashed with ValueError in command(): invalid literal for int() with base 10: ''apportHighConfirmed42No
420747ClearWeatherScreenlet.py crashed with TypeError in show_error()screenletsLowTriaged42No
305062Upgrade of package ca-certificates has many issues: install/upgrade: subprocess post-installation script returned error exit status 1 (while running final ldconfig)ca-certificatesMediumTriaged41No
403135Notification area icon wrongly rendered/uses bg_color as a background (multiple apps)amsnLowConfirmed41No
403135Notification area icon wrongly rendered/uses bg_color as a background (multiple apps)gajimUndecidedConfirmed41No
403135Notification area icon wrongly rendered/uses bg_color as a background (multiple apps)alltrayLowConfirmed41No
403135Notification area icon wrongly rendered/uses bg_color as a background (multiple apps)gxneurUndecidedConfirmed41No
403135Notification area icon wrongly rendered/uses bg_color as a background (multiple apps)wine1.2LowTriaged41No
403135Notification area icon wrongly rendered/uses bg_color as a background (multiple apps)gnome-panelLowConfirmed41No
403135Notification area icon wrongly rendered/uses bg_color as a background (multiple apps)checkgmailLowConfirmed41No
305062Upgrade of package ca-certificates has many issues: install/upgrade: subprocess post-installation script returned error exit status 1 (while running final ldconfig)ca-certificates-javaMediumTriaged41No
790478package dahdi-dkms ... failed to install/upgrade: dahdi kernel module failed to build (You do not appear to have the sources for the ... kernel installed.)dahdi-linuxUndecidedConfirmed41No
917302empathy-chat crashed with SIGSEGV in g_str_hash()folksHighTriaged40No
582055swfdec-mozilla failed to remove: update-alternatives: error: no alternatives for iceape-flashplugin.swfdec-mozillaMediumConfirmed40No
448180gnome-alsamixer crashed with SIGSEGV in g_closure_invoke()gnome-alsamixerHighConfirmed40No
798414update-initramfs should produce a more helpful error when there isn't enough free spaceinitramfs-toolsMediumTriaged40No
721244computer-janitor-gtk crashed with DBusException in call_blocking(): org.freedesktop.DBus.Python.computerjanitord.errors.PermissionDeniedError: com.ubuntu.computerjanitor.updatesystemcomputer-janitorUndecidedConfirmed39No
730385iphone-set-info crashed with SIGSEGV in plist_get_string_val()libgpodMediumTriaged39No
927384indicator-weather crashed with SIGSEGV in g_array_free()indicator-weatherHighConfirmed39No
745807ClockScreenlet.py crashed with AttributeError in remove_shape(): 'ClockScreenlet' object has no attribute 'main_view'screenletsMediumTriaged39No
745807ClockScreenlet.py crashed with AttributeError in remove_shape(): 'ClockScreenlet' object has no attribute 'main_view'indiv-screenletsMediumTriaged39No
851982compiz crashed with SIGSEGV in CompWindow::id() from getPaintMask() [compizminimizedwindowhandler.h] from unity::UnityWindow::glPaint()unityHighConfirmed38No
742516gimp-2.6 crashed with SIGSEGV in g_closure_invoke() (with oxygen GTK theme)gimpMediumConfirmed38No
220961[MASTER] ubiquity crashes instead of notifying the user of not enough disk spaceubiquityHighTriaged38No
930839update-manager crashed with SIGABRT in __assert_fail_base(): Assertion !xcb_xlib_unknown_req_in_deq failed in dequeue_pending_requestupdate-managerMediumTriaged38No
49613[MASTER] Adobe Flash does not support WMODE (Flash content always rendered on top of web pages)nspluginwrapperUndecidedConfirmed38No
49613[MASTER] Adobe Flash does not support WMODE (Flash content always rendered on top of web pages)gnashUndecidedConfirmed38No
588960package dkimproxy 1.2-3 failed to install/upgrade: subprocess installed post-installation script returned error exit status 2dkimproxyUndecidedConfirmed38No
85382MASTER firefox crashed - colorzilla - [@nsNativeComponentLoader::AutoRegisterComponent]firefoxMediumConfirmed38No
649487telepathy-butterfly crashed with UnicodeDecodeError in _signal_text_received()telepathy-butterflyUndecidedConfirmed38No
938379openbox crashed with SIGABRT after closing context menuopenboxMediumConfirmed37No
619363aptdaemon dbus backend crash in self._transaction.run(defer=True)aptdaemonHighConfirmed37No
820601rhythmbox-metadata crashed with SIGSEGV in _start()rhythmboxMediumConfirmed37No
529714rhythmbox crashed with SIGSEGV in _nss_wins_gethostbyname_r()eglibcLowTriaged37No
838812rhythmbox-metadata crashed with SIGSEGV in g_type_check_value()rhythmboxMediumTriaged37No
705988[master] Untrusted packages can not be installedsoftware-centerMediumConfirmed37No
986929Can't download any package, message :"Check your internet connection : 'Failed to fetch http://archive.ubuntu.com/ubuntu/pool/main/o/openssl/libssl1.0.0_1.0.0e-2ubuntu4.2_i386.deb 404 Not Found [IP: 91.189.92.169 80]'"software-centerUndecidedConfirmed36No
647349package software-center 2.0.7 failed to install/upgrade: subprocess installed post-installation script returned error exit status 1. software-centerHighConfirmed36No
764701update-apt-xapian-index crashed with DatabaseLockError in __init__(): Unable to get write lock on /var/cache/apt-xapian-index/index.2: already lockedapt-xapian-indexMediumConfirmed36No
945119Inconsistency between available packages in the cache and package namespython-aptHighTriaged36No
193439update-grub fails when default is "saved" (expr: non-numeric argument)grubLowTriaged36No
49579screen doesn't lock when panel menu is opengnome-screensaverLowTriaged36No
787465View->Show MenuBar isn't working in 11.04 and later in gnome-terminalgnome-terminalUndecidedConfirmed36No
445303policykit-1 password dialog sometimes hangspolicykit-1-gnomeHighTriaged35No
927284BUG: Bad page map in process firefox pte:0f544065 pmd:216e2067linuxHighConfirmed35No
749673WARNING: at /build/buildd/linux-2.6.38/kernel/power/suspend_test.c:53 suspend_test_finish 0x86/0x90()linuxUndecidedConfirmed35No
733507cpufreqd assert failure: *** glibc detected *** /usr/sbin/cpufreqd: free(): invalid pointer: 0x09067b10 ***cpufreqdMediumConfirmed35No
932382compiz crashed with SIGSEGV in g_type_check_instance() from g_signal_emit_valist() from g_signal_emit() from ... from CcpScreen::timeout()compizconfig-backend-gconfHighTriaged35No
531190upower (devkit-power) reporting bad data when AC cable is unpluggedupowerHighConfirmed34No
811377prelink.bin assert failure: prelink.bin: ../../src/conflict.c:763: prelink_build_conflicts: Assertion `j < ndeps' failed.prelinkMediumConfirmed33No
651010package firmware-b43-installer 4.150.10.5-4 failed to install/upgrade: subprocess installed post-installation script returned error exit status 1b43-fwcutterHighTriaged33No
445499ubiquity crashed with DebconfError in command()ubiquityUndecidedConfirmed32No
10905Keyboard shortcuts, window management - Can't use any global keyboard shortcuts or hotkeys when applet/menu is openunityUndecidedConfirmed32No
984063package ruby-rvm 1.6.9-0ubuntu2 failed to install/upgrade: subprocess installed post-installation script returned error exit status 2ruby-rvmUndecidedConfirmed32No
23810Evolution is unusable in 1024x768evolutionMediumTriaged32No
208825yiff-server fails to install: Starting Y Sound Server: ERROR.yiffUndecidedConfirmed32No
90312[apport] gksu crashed with SIGSEGV in gdk_draw_pixbuf()gksuMediumConfirmed32No
811689gnome-panel crashed with SIGSEGV in g_closure_invoke()gnome-panelMediumConfirmed31No
855166software-center crashed with DBusException in call_blocking(): org.freedesktop.DBus.Error.ServiceUnknown: The name :1.370 was not provided by any .service filessoftware-centerMediumConfirmed31No
930004update-manager assert failure: python: ../../src/xcb_io.c:273: poll_for_event: Assertion `!xcb_xlib_threads_sequence_lost' failed.update-managerMediumTriaged31No
136371cyclone crashed with SIGSEGV in __libc_start_main()rss-glxMediumConfirmed31No
855166software-center crashed with DBusException in call_blocking(): org.freedesktop.DBus.Error.ServiceUnknown: The name :1.370 was not provided by any .service filesoneconfUndecidedNew31No
492782[i945gme] Mouse cursor disappears after restarting screen (xrandr / resume)xserver-xorg-video-intelUndecidedConfirmed31No
869986Fusionforge fails-to-install cleanupfusionforgeUndecidedConfirmed31No
420968cupsd crashed with SIGABRT in __kernel_vsyscall()cupsMediumConfirmed31No
340479apt_check.py crashed with SIGSEGV in pkgCacheGenerator::MergeList()update-notifierMediumTriaged31No
768184[i965gm] GPU lockup (ESR: 0x00000001 IPEHR: 0x01800020) - Black screen (dpms?)xserver-xorg-video-intelHighTriaged31No
869986Fusionforge fails-to-install cleanupgforgeUndecidedConfirmed31No
645203npviewer.bin assert failure: libgcc_s.so.1 must be installed for pthread_cancel to worknspluginwrapperMediumNew30No
198758[hardy] ccsm crashed with Error in setlocale()compizconfig-settings-managerUndecidedConfirmed30No
805154gdm-simple-slave crashed with SIGSEGV in _nss_compat_getpwnam_r()gdmHighTriaged30No
954029package gettext 0.18.1.1-5ubuntu3 failed to install/upgrade: gettext:i386 0.18.1.1-5ubuntu3 (Multi-ArchgettextUndecidedConfirmed30No
436788gnome-panel assert failure: ERROR:poa.c:1028:ORBit_POA_activate_object_T: assertion failed: ((poa->life_flags & ORBit_LifeF_DeactivateDo) == 0)gnome-panelMediumConfirmed30No
962892Xorg crashed with SIGABRT in __assert_fail_base() unless clear compiz/unity settingsxorg-serverHighTriaged30No
332332mpd won't properly install untill localhost changed to 127.0.0.1 in /etc/mpd.confmpdMediumTriaged29No
976463mission-control-5 crashed with SIGABRT in __libc_message()telepathy-glibHighConfirmed29No
260918needed: libv4l and associated application patches (or "gspca stopped working in 2.6.27")camoramaUndecidedConfirmed29No
932125compiz crashed with SIGSEGV in Glib::Source::prepare_vfunc()libcompizconfigUndecidedConfirmed29No
982609invalid smb.conf filesamba4UndecidedConfirmed29No
932125compiz crashed with SIGSEGV in Glib::Source::prepare_vfunc()compizconfig-backend-gconfMediumTriaged29No
821018gvfsd-archive crashed with SIGABRT: (!job->finished)gvfsHighConfirmed29No
427799firefox crashed with signal 5 in gdk_x_error()firefox-3.5MediumNew29No
178442Pulseaudio fails to initialize ICE1712 chipsetspulseaudioLowConfirmed29No
595015package syscp 1.4.2.1-2 failed to install/upgrade: subprocess installed post-installation script returned error exit status 1syscpLowConfirmed29No
438356brcupsconfig3 assert failure: *** stack smashing detected ***: /usr/Brother/cupswrapper/brcupsconfig3 terminatedbrother-cups-wrapper-laserMediumConfirmed28No
495123grub-probe: error: not a directorygrub2MediumTriaged28No
729288squid failed to restart after update to squid 2.7.STABLE7-1ubuntu12.2squidHighConfirmed28No
833326ccsm crashed with SIGSEGV in ccsCanDisablePlugin()compizconfig-settings-managerMediumConfirmed28No
634964bluetooth-applet crashed with SIGSEGVgnome-bluetoothMediumConfirmed28No
308736package sun-java6-bin None [modified: /var/lib/dpkg/info/sun-java6-bin.list] failed to install/upgrade: subprocess pre-installation script returned error exit status 1sun-java6UndecidedNew28No
926758notification-daemon crashed with signal 5 in g_return_if_fail_warning()notification-daemonMediumConfirmed27No
653630brasero crashed with SIGSEGV in g_type_instance_get_private()braseroMediumTriaged27No
540801X server starts before Plymouth, or a very short time after (no or brief splash)plymouthLowTriaged27No
331675package linux-image-2.6.28-8-generic 2.6.28-8.24 failed to install/upgrade: subprocess post-installation script returned error exit status 2 (ImportError: No module named NvidiaDetector)nvidia-commonUndecidedConfirmed27No
640470vino-server assert failure: *** glibc detected *** /usr/lib/vino/vino-server: double free or corruption (out): 0xb6d083f8 ***vinoHighConfirmed27No
321955qemulator.py crashed with IndexError in on_comboboxCDromdrive_changed()qemulatorMediumTriaged27No
459389glunarclock-applet-2 crashed with SIGSEGV in strcmp()glunarclockMediumIn Progress27No
533728Add documentation about how to change grub2 theme (running update-grub fails with No path or device is specified.)grub2LowTriaged26No
413624jockey-gtk crashed with BackendCrashError in convert_dbus_exceptions()jockeyMediumConfirmed26No
631498bluetooth-applet crashed with signal 5 in g_object_newv()gnome-bluetoothMediumNew26No
810681gnome-terminal crashed with SIGABRT in raise()gnome-terminalMediumTriaged26No
160264[nvidia] compiz displays white screen when lockedgnome-screensaverMediumNew26No
817460gsettings-data-convert crashed with signal 5 in g_settings_schema_get_value()gnome-power-managerMediumTriaged26No
832270software-center crashed with IndexError in __getitem__(): could not find tree pathsoftware-centerMediumConfirmed26No
660379Make mysql-cluster depend on libmysqlclient16 from mysql-5.1 (rather than conflict)mysql-cluster-7.0HighIn Progress26No
738762indicator-weather crashed with ImportError in /usr/lib/pymodules/python2.7/desktopcouch/records/server.py: No module named application.serverdesktopcouchUndecidedNew26No
268685IO errors in install.py, such as ENOSPC should give more detailed errors to the UI.usb-creatorMediumConfirmed26No
88179[apport] scim-launcher crashed with SIGSEGV in QTextCodec::fromUnicode()scimMediumConfirmed26No
455421rhythmbox crashed with SIGSEGV in g_object_set()gstreamer0.10MediumTriaged26No
137527Unhelpful response when inserting encrypted DVD in default installationtotemLowTriaged26No
519444gwibber-service crashed with RuntimeError in find_port__linux()desktopcouchMediumConfirmed25No
440426beh crashed with SIGSEGV in setlocale()perlMediumConfirmed25No
328862[MASTER] update-manager should deal with corrupted debs betterupdate-managerMediumTriaged25No
417363synaptic crashed with SIGSEGV in USHORT::operator=()synapticMediumNew25No
580961unzip fails to deal correctly with filename encodingsunzipHighTriaged25No
921889package ttf-mscorefonts-installer (not installed) failed to install/upgrade: subprocess new pre-installation script returned error exit status 128msttcorefontsHighConfirmed25No
328862[MASTER] update-manager should deal with corrupted debs betteraptUndecidedConfirmed25No
913324unity-panel-service crashed with SIGSEGV in panel_indicator_entry_accessible_get_n_children() from atk_object_get_n_accessible_children()unityHighConfirmed24No
617101package g15daemon 1.9.5.3-8ubuntu1 failed to install/upgrade: if /dev/input/uinput is missingg15daemonMediumTriaged24No
404271notify-osd crashed with signal 5 in _XError()notify-osdMediumTriaged24No
746717WARNING: at /build/buildd/linux-2.6.38/net/sched/sch_generic.c:256 dev_watchdog 0x213/0x220()linuxMediumTriaged24No
350289file-roller crashed with SIGSEGV in g_closure_invoke()file-rollerMediumTriaged24No
295253[MASTER] update failed, post-installation script returned exit status 1nullmailerMediumConfirmed24No
682788Improve Unity menusunityHighIn Progress24No
576253dahdi-dkms failed to install/upgrade (failed to download firmware from downloads.digium.com)dahdi-linuxMediumTriaged24No
571743system upgrade 9.10 --> 10.04 could not calculate upgrade when both xubuntu-desktop and ubuntu-desktop are installedupdate-managerMediumIn Progress24No
772482package monodoc-base 2.6.7-5ubuntu3 failed to install/upgrade: ErrorMessage: subprocess installed post-installation script returned error exit status 1monoMediumTriaged24No
682788Improve Unity menusmetacityUndecidedIn Progress24No
592842appmenu doesn't work with apps run as sudo rootindicator-appmenuLowTriaged24No
627879package ubufox (not installed) failed to install/upgrade: no package named `ubufox' is installed, cannot configureaptLowTriaged24No
424857update-apt-xapian-index crashed with SystemError in open()apt-xapian-indexMediumTriaged24No
855463unity-2d-launcher crashed with SIGSEGV in QDeclarativeObjectScriptClass::newQObject()unity-2dCriticalConfirmed24No
92599Incorrect (low/stuttering) refresh rate with NVIDIA drivernvidia-graphics-driversWishlistTriaged23No
125183gnome-alsamixer crashed with SIGSEGV in gam_mixer_show_props_dialog()gnome-alsamixerMediumTriaged23No
18995[MASTER] "Open With" dialog not user-friendlyfirefoxLowTriaged23No
829818e-calendar-factory crashed with SIGABRT in raise()evolution-data-serverMediumTriaged23No
18995[MASTER] "Open With" dialog not user-friendlymozilla-thunderbirdUndecidedConfirmed23No
18995[MASTER] "Open With" dialog not user-friendlyfirefox-3.5LowConfirmed23No
39890characters change when selecting textpopplerMediumTriaged23No
412155calibre-parallel crashed with EOFError in main()calibreLowTriaged23No
78725MASTER firefox crashed [@vfprintf] ... -- libvlc.so.0glibcUndecidedNew23No
617130openoffice.org-voikko conflicts with openoffice.org-coreopenoffice.org-voikkoUndecidedConfirmed23No
203784bonobo-activation-server crashed with SIGSEGV in g_type_check_instance_cast()libbonoboMediumConfirmed23No
420053at-spi-registryd crashed with SIGSEGV in _SmcProcessMessage()at-spiMediumTriaged23No
457916ubuntuone-syncdaemon crashed with DBusException in call_blocking(): DBusException: org.freedesktop.DBus.Error.Disconnected: Connection was disconnected before a reply was receivedubuntuone-clientUndecidedConfirmed23No
222511telepathy-butterfly crashed with KeyError in remove_channel()telepathy-butterflyMediumTriaged23No
301958[needs-packaging] no working driver for sis 671/771 video cardsxserver-xorg-video-sisWishlistTriaged23No
711429nautilus crashed with SIGSEGV in g_closure_invoke()nautilusMediumTriaged23No
719435package lib32ncursesw5 (not installed) failed to install/upgrade: trying to overwrite '/lib32/libncursesw.so.5.7', which is also in package ia32-libs 20090808ubuntu10~wineppa3ncursesUndecidedConfirmed23No
981140package libatk-adaptor-schemas (not installed) failed to install/upgrade: trying to overwrite '/usr/share/glib-2.0/schemas/org.a11y.atspi.gschema.xml', which is also in package libatk-adaptor 2.2.1-0ubuntu1at-spi2-atkUndecidedConfirmed22No
898336tumblerd crashed with SIGSEGV in g_type_check_instance_is_a()tumblerMediumTriaged22No
132103windows with no title bar when effects are enabledcompizconfig-settings-managerMediumConfirmed22No
73536MASTER Firefox crashes on instant X server shutdownfirefox-3.0MediumTriaged22No
694913package install failure due to frontend: Fatal IO error on X servermsttcorefontsMediumTriaged22No
987446package zentyal-core 2.3.4 failed to install/upgrade: ErrorMessage: subprocess installed post-installation script returned error exit status 8zentyal-coreUndecidedConfirmed22No
505339package libatlas3gf-3dnow 3.6.0-24ubuntu1 failed to install/upgrade: atlasLowTriaged22No
922949installation process can crash due to an issue with one package when choosing "install updates" as part of the installaptHighTriaged22No
711162ubuntuone-login crashed with ValueError in call_async(): Unable to guess signature from an empty dictubuntuone-clientHighConfirmed22No
711162ubuntuone-login crashed with ValueError in call_async(): Unable to guess signature from an empty dictdbus-pythonUndecidedConfirmed22No
837354gnome-power-statistics crashed with SIGABRT in raise()gnome-power-managerMediumTriaged22No
852383compiz crashed with SIGABRT in raise()nuxCriticalConfirmed22No
993506nvidia kernel module fails to build on 3.4.x kernel [fatal error: asm/system.h: No such file or directory]nvidia-graphics-driversHighConfirmed22No
993506nvidia kernel module fails to build on 3.4.x kernel [fatal error: asm/system.h: No such file or directory]nvidia-graphics-drivers-updatesUndecidedConfirmed22No
443361*** glibc detected *** /usr/bin/compiz.real: corrupted double-linked list: 0x09ef5478 ***nvidia-graphics-drivers-180HighTriaged22No
307613arno-iptables fails to install/upgrade : ERROR: postinst return exit status 2 - The required variable EXT_IF is empty!arno-iptables-firewallMediumConfirmed21No
922603software-properties-kde crashed with SIGSEGV in createClassType()sip4MediumConfirmed21No
261523update-apt-xapian-index crashed with SystemError in open()apt-xapian-indexMediumTriaged21No
421211seahorse-agent crashed with SIGABRT in __kernel_vsyscall()seahorse-pluginsMediumTriaged21No
554172system services using "console output" not starting at bootlinuxHighConfirmed21No
13661get proxy config from user configuration if setsynapticLowTriaged21No
584272boa-constructor fails compilation during upgrade from Hardy to Lucid - breaks python post-installationboa-constructorCriticalConfirmed21No
203299usplash crashed with SIGSEGV in __svgalib_get_perm()linuxUndecidedConfirmed21No
165865markers must take object's stroke color (SVG 1.2 feature)inkscapeLowTriaged21No
330193btnx crashed with SIGSEGV in __strcpy_chk()btnxMediumConfirmed21No
537619pitivi crashed with TypeError in do_simple_paint()pitiviUndecidedNew21No
723841file-roller crashed with SIGSEGV in egg_tree_multi_drag_button_release_event()file-rollerHighTriaged21No
927168compiz crashed with SIGSEGV in drisw_update_tex_buffer() from ... from __glXBindTexImageEXT() from TfpTexture::enable() from enableFragmentOperationsAndDrawGeometry()compizHighConfirmed21No
562948Upgrade 8.04 LTS -> 10.04 LTS fails at circular dependency with openoffice.org extensionsupdate-managerHighConfirmed21No
848915$DISPLAY not set in some cases, resulting in cryptic tracebackupdate-managerHighTriaged21No
925503nautilus segfaults in gtk_ui_manager_new_merge_id()nautilusHighTriaged20No
512173gnome-screensaver-gl-helper crashed with SIGSEGV in _fini()nvidia-graphics-driversLowConfirmed20No
834067zeitgeist-daemon crashed with SIGSEGV in Xapian::WritableDatabase::add_document()zeitgeist-extensionsMediumTriaged20No
781931New windows are moved to front but don't take focuscompizMediumConfirmed20No
781931New windows are moved to front but don't take focusunityHighIn Progress20No
758013apt-clone crashed with SystemError in _restore_package_selection_in_cache(): E:Unable to correct problems, you have held broken packages.apt-cloneMediumTriaged20No
560703package yiff-server 2.14.5-5.1 failed to install/upgrade: subprocess installed post-installation script returned error exit status 1yiffMediumTriaged20No
481743package linux-image-2.6.31-15-generic 2.6.31-15.50 failed to install/upgrade: exit status 1 - /usr/share/debconf/confmodule: line 42: printf: write error: Broken pipedebconfUndecidedNew20No
634680update-software-center crashed with EOFError in ()software-centerUndecidedConfirmed20No
353144package rocksndiamonds 3.2.6.0+dfsg-3 failed to install/upgrade: subprocess post-installation script returned error exit status 2rocksndiamondsMediumTriaged20No
733325bannertops assert failure: *** glibc detected *** ML-1510_700: free(): invalid next size (normal): 0xb9657dc0 ***cupsMediumNew20No
743541indicator-weather crashed with SIGSEGV in dbusmenu_menuitem_build_variant()indicator-weatherMediumConfirmed20No
691070compiz assert failure: *** glibc detected *** compiz: corrupted double-linked list: 0x000000000195ae60 ***compizHighConfirmed20No
862430window flicker for a short time after switching workspacescompizMediumConfirmed20No
924647mail-notification crashed with SIGSEGV in mn_mail_icon_set_tip_widget()mail-notificationMediumConfirmed20No
934062"Keyboard Shortcuts" overlay can cause annoyanceunityHighConfirmed20No
115637headphones on laptop don't mute laptop speakers on Toshiba A120-237linuxLowConfirmed19No
549468plymouthd crashed with SIGSEGV in free()plymouthMediumTriaged19No
853060ubuntuone-installer crashed with GError in function(): Failed to execute child process "ubuntuone-control-panel-gtk" (No such file or directory)ubuntuone-installerHighConfirmed19No
937132ubuntu-sso-login crashed with RuntimeError in /usr/lib/python2.7/dist-packages/gi/overrides/Gdk.py: Gdk couldn't be initializedubuntu-sso-clientHighConfirmed19No
208507trackerd crashed with SIGSEGV intracker_timer_end trackerMediumConfirmed19No
388633ComboBox has a big blank area above the position of its controlgtk+2.0LowTriaged19No
938844unity-2d-shell crashed with SIGSEGV in data()unity-2dMediumConfirmed19No
837525package PACKAGE failed to install/upgrade: error writing to '': No such file or directorydpkgMediumConfirmed19No
819251package phpmyadmin 4:3.3.10-1 failed to install/upgrade: le sous-processus script post-installation installé a retourné une erreur de sortie d'état 10dbconfig-commonUndecidedConfirmed19No
325001hxplay.bin crashed with SIGSEGV in pthread_mutex_lock()helix-playerMediumConfirmed19No
952546nautilus crashed with SIGSEGV in _gdk_device_xi2_reset_scroll_valuators()gtk+3.0HighTriaged19No
362342nautilus crashed with SIGSEGV in g_list_remove()nautilusMediumTriaged19No
35223Laptop TFT monitor - brightness level is not savedgnome-power-managerMediumTriaged19No
70535nautilus crashes when copying a 4G file on a vfat volumegnome-vfs2LowTriaged19No
791944package samba 2:3.5.8~dfsg-1ubuntu2.2 failed to install/upgrade: broken permissions cause daemons not to start correctlysambaMediumConfirmed19No
853832indicator-weather crashed with SIGABRT in raise()indicator-weatherHighTriaged19No
834133gnome-codec-install crashed with Depends in _run(): libstdc++6 (>= 4.1.1) but 4.6.1-7ubuntu2 is to be installedgnome-codec-installMediumTriaged19No
238606[MASTER] Flash player doesn't work properly on Firefox 3 64bits (crash,gray square)adobe-flashpluginUndecidedConfirmed18No
93849Feature request: Adaptive Multi-Rate Codec Supportgstreamer0.10-ffmpegWishlistNew18No
93849Feature request: Adaptive Multi-Rate Codec SupportmplayerUndecidedNew18No
868176package lightdm-gtk-greeter 1.0.1-0ubuntu1 failed to install/upgrade: lightdm-gtk-greeter: config file '/etc/lightdm/lightdm-gtk-greeter-ubuntu.conf' is a circular linklightdmHighConfirmed18No
942219indicator-weather crashed with SIGSEGVindicator-weatherMediumConfirmed18No
24061GPG error with apt-get/aptitude/update-manager behind proxy (BADSIG 40976EAF437D05B5)aptHighTriaged18No
825350nvidia-detector crashed with ValueError in __get_value_from_name(): invalid literal for int() with base 10: '173-updates'nvidia-commonMediumConfirmed18No
446657Bluetooth's on/off status doesn't update from the SetProperty D-Bus method that bluetoothd sendsbluezUndecidedConfirmed18No
555957package fglrx (not installed) failed to install/upgrade: make returns error: mixed implicit and normal rulesfglrx-installerHighConfirmed18No
706714Streamtuner can't read online streamdirectories anymorestreamtunerUndecidedConfirmed18No
830495indicator-weather crashed with SIGSEGV in dbusmenu_menuitem_property_get_variant()indicator-weatherMediumConfirmed18No
830495indicator-weather crashed with SIGSEGV in dbusmenu_menuitem_property_get_variant()libdbusmenuUndecidedConfirmed18No
584435package prelude-lml 0.9.15-1 failed to install/upgrade: subprocess installed post-installation script returned error exit status 1prelude-lmlMediumConfirmed18No
839672zeitgeist-daemon crashed with DatabaseError in _check_index(): Error reading block 510: got end of filezeitgeist-extensionsMediumConfirmed18No
417757[regression] all network apps / browsers suffer from multi-second delays by default due to IPv6 DNS lookupseglibcHighTriaged18No
173469xmms2tray crashed with IOError in self.quit)()xmms2trayUndecidedConfirmed18No
176600package timidity 2.13.2-16ubuntu1 failed to install/upgrade: subprocess post-installation script returned error exit status 1timidityMediumConfirmed18No
261456peercast crashed with SIGSEGV in feof()peercastMediumConfirmed18No
859805geoclue-master crashed with signal 5 in __libc_start_main()geoclueMediumConfirmed18No
656735alacarte needs to depend on gnome-panelalacarteMediumTriaged18No
435968vlc assert failure: vlc: /build/buildd/libdvdnav-4.1.3/src/vm/vm.c:1485: process_command: Assertion `0' failed.libdvdnavMediumTriaged18No
913024nepomukservicestub crashed with SIGSEGV in pthread_cond_wait@@GLIBC_2.3.2()kde-runtimeHighConfirmed18No
946285compiz crashed with SIGSEGV in operator() [unity-mt-grab-handles.cpp] from ... from unity::MT::GrabHandleGroup::forEachHandle()unityMediumConfirmed18No
969733oss4-dkms 4.2-build2005-2ubuntu1: oss4 kernel module failed to build (cp: cannot stat `/lib/modules/3.2.0-23-generic/source/include/linux/limits.h': No such file or directory)oss4UndecidedConfirmed18No
272326computertemp crashed with OSError in listdir()computertempMediumTriaged18No
705215software-center crashed with DBusException in call_blocking()software-centerUndecidedConfirmed18No
711478package ttf-droid 1.00~b112 dfsg 1-0ubuntu1 failed to install/upgrade due to: /etc/defoma/hints/ttf-droid.hints: Unable to open, or empty.ttf-droidUndecidedConfirmed18No
808202apport wrongly duplicates package installation failure reports.apportHighConfirmed18No
861125systray.py crashed with SIGSEGV in gtk_widget_style_get()hplipMediumConfirmed18No
195102jockey-gtk crashed with ImportError in ()python-supportHighConfirmed18No
818760update-manager crashed with timeout in readline(): timed outupdate-managerHighTriaged18No
804330nautilus crashed with SIGSEGV in g_file_query_info()nautilusMediumTriaged18No
804480package gnome-games-extra-data (not installed) failed to install/upgrade: trying to overwrite '/usr/share/gnome-games-common/cards/bonded.svg', which is also in package gnome-games-common 1:3.0.2-0ubuntu1gnome-games-extra-dataMediumTriaged18No
238606[MASTER] Flash player doesn't work properly on Firefox 3 64bits (crash,gray square)flashplugin-nonfreeUndecidedConfirmed18No
43066Window list behaves bad when panel is vertical.libwnckMediumIn Progress17No
975320update-manager crashed with Depends in _run_in_dialog(): libx264-120 but it is not installedaptdaemonMediumConfirmed17No
419143Printing from evince (and perhaps other GTK apps) to PostScript printers is broken ("0a" bytes inserted into PostScript output)cairoHighTriaged17No
834038software-center-gtk3 crashed with DBusException in _convert_dbus_exception(): org.freedesktop.DBus.Error.UnknownMethod: Method "GetAll" with signature "s" on interface "org.freedesktop.DBus.Properties" doesn't existsoftware-centerMediumTriaged17No
413767gdm-simple-slave crashed with SIGSEGV in g_cclosure_marshal_VOID()gdmMediumTriaged17No
43066Window list behaves bad when panel is vertical.gnome-panelMediumIn Progress17No
178724rhythmbox-metadata crashed with SIGSEGV in jpeg_idct_ifast()libjpeg6bMediumConfirmed17No
917974unity-music-daemon crashed with SIGSEGV in g_bit_lock()unity-lens-musicCriticalConfirmed17No
571707fsck progress stalls at boot, plymouthd/mountall eats CPUplymouthUndecidedTriaged17No
278807package cmake 2.6.0-4ubuntu2 failed to install/upgrade: subprocess post-installation script returned error exit status 2cmakeLowTriaged17No
871083gzip -9n sometimes generates a different output file on different architectureslibtasn1-3MediumTriaged17No
871083gzip -9n sometimes generates a different output file on different architecturesclutter-1.0MediumTriaged17No
610975relocation error with latest wxwidgets2.8wxwidgets2.8MediumTriaged17No
730993WARNING: at /build/buildd/linux-2.6.38/kernel/power/suspend_test.c:53 suspend_test_finish 0x89/0x90()linuxUndecidedConfirmed17No
552286package nvidia-* failed to install/upgrade: nvidia-* kernel module failed to build (Failed CC sanity check)nvidia-graphics-driversWishlistTriaged17No
552286package nvidia-* failed to install/upgrade: nvidia-* kernel module failed to build (Failed CC sanity check)nvidia-graphics-drivers-173WishlistTriaged17No
552286package nvidia-* failed to install/upgrade: nvidia-* kernel module failed to build (Failed CC sanity check)nvidia-graphics-drivers-96UndecidedConfirmed17No
227774[8.04] alacarte crashed with AttributeError in __getPath()alacarteMediumTriaged17No
419143Printing from evince (and perhaps other GTK apps) to PostScript printers is broken ("0a" bytes inserted into PostScript output)popplerUndecidedTriaged17No
357673No notification when sliding audio volume, muting volume on ThinkPad X23, X24, X31, X32, X41, X60, T22, T40, T41, T42, T43, T43p, T60, R50e, R51, R52gnome-settings-daemonMediumTriaged17No
927727bamfdaemon crashed with SIGABRT in __GI___assert_fail()bamfCriticalConfirmed17No
192270npviewer.bin crashed with SIGSEGV in pthread_mutex_lock()nspluginwrapperMediumNew17No
932569gnome-shell crashed with SIGSEGV in _clutter_actor_finish_queue_redraw()gnome-shellHighConfirmed17No
843375goa-daemon crashed with SIGSEGV in ffi_call_SYSV()gnome-online-accountsMediumConfirmed17No
131868fast-user-switch-applet crashed with signal 5 in pthread_getspecific()fast-user-switch-appletMediumTriaged17No
222794cameramonitor crashed with RuntimeError in signal_handler()cameramonitorUndecidedNew17No
878198Difficult to grab window borders in unity-2dmetacityUndecidedConfirmed17No
432252at-spi-registryd assert failure: ERROR:orbit-object.c:149:do_unref: assertion failed: (robj->refs < ORBIT_REFCOUNT_MAX && robj->refs > 0)at-spiMediumTriaged16No
645462TypeError in Battery Status: an integer is requiredawn-extrasUndecidedConfirmed16No
348372nspluginviewer crashed with SIGSEGV in PL_HashTableLookupConst()nsprMediumConfirmed16No
641652update-apt-xapian-index crashed with DatabaseError in updateIndex()apt-xapian-indexUndecidedConfirmed16No
342510systray.py crashed with NameError in setMenu(), after reboot and loginhplipUndecidedConfirmed16No
624824bcfg2-server crashed with KeyError in __init__()bcfg2UndecidedNew16No
554133ubuntuone-preferences crashed with CancelledError in __init__()desktopcouchMediumConfirmed16No
832536dconf-service crashed with signal 5 in __libc_start_main()d-confMediumConfirmed16No
550135package contacts-snapshot (not installed) failed to install/upgrade: trying to overwrite '/usr/bin/contacts', which is also in package contacts-hildon 0:0.9-1ubuntu3contacts-snapshotMediumTriaged16No
737584package zoneminder 1.24.2-2build3 failed to install/upgrade: el subproceso instalado el script post-installation devolvió el código de salida de error 255zoneminderMediumConfirmed16No
755127compiz crashed with SIGSEGV in pthread_mutex_lock()compizMediumConfirmed16No
312740package texlive-base 2007.dfsg.1-2 failed to install/upgrade: exit status 1 - fmtutil-sys failedtexlive-baseUndecidedConfirmed16No
205463alacarte crashed with IOError in copyItem() (when copying item with / in name)alacarteMediumTriaged16No
772063App icon on the Unity Launcher lost track of running instancebamfHighConfirmed16No
761824indicator-weather crashed with SIGSEGV in g_type_check_instance_cast()indicator-weatherMediumConfirmed16No
986786[MASTER] larger packages should use lzma compressionapp-install-data-ubuntuWishlistTriaged16No
188422locations list can go over the screen bordergnome-panelLowTriaged16No
436392systemsettings crashed with AttributeError in maintenance_command() after "clean printer heads" button is pressedkdeadminMediumConfirmed16No
618216do-release-upgrade crashed with AttributeError in init_proxy()update-managerUndecidedConfirmed16No
311581MASTER Network Manager integrated ppp support - should allow the configuration of dial up modemsnetwork-managerWishlistConfirmed16No
197224nautilus crashed with SIGSEGV in g_file_query_info()language-pack-gnome-bnUndecidedConfirmed16No
115927[apport] totem-video-thumbnailer crashed with SIGSEGV in g_object_set_valist()gst-plugins-good0.10MediumTriaged16No
286419mkfontscale crashed with signal 7 in FT_Stream_ReadLong()freetypeMediumConfirmed16No
741759indicator-weather crashed with SIGABRT in raise()indicator-weatherMediumConfirmed16No
9441the locate pointer option breaks other keybindingsgnome-settings-daemonMediumTriaged16No
86184Can't change cursor style using Compiz.compizMediumConfirmed16No
577041package mysql-cluster-client-5.1 (not installed) failed to install/upgrade: trying to overwrite '/usr/bin/mysql', which is also in package mysql-client-core-5.1 0:5.1.41-3ubuntu12mysql-cluster-7.0HighTriaged15No
255139evolution crashed with SIGSEGV in pango_default_break()pango1.0MediumTriaged15No
96454[Feisty, Gutsy] MASTER: HP LaserJet 1000/1005/1018/1020 don't work because of missing firmwarerestricted-managerWishlistConfirmed15No
938784indicator-weather crashed with SIGABRT in __libc_message()indicator-weatherMediumConfirmed15No
392850 *** glibc detected *** /usr/bin/compiz.real: double free or corruption (!prev): 0x0000000002458930 ***nvidia-graphics-drivers-180HighTriaged15No
754297Synaptic Package Manager not responding to status changesynapticMediumConfirmed15No
951537BUG: unable to handle kernel NULL pointer dereference at 00000140linuxHighConfirmed15No
212312EasyCrypt.py crashed with KeyError in closeAllCrypts()easycryptUndecidedConfirmed15No
205201Programs run as root do not follow user themingkdesudoLowConfirmed15No
565724package fakeroot (not installed) failed to install/upgrade: unable to open '/usr/lib64/libfakeroot/libfakeroot-tcp.so.dpkg-new': No such file or directoryfakerootUndecidedConfirmed15No
203870gdesklets-daemon crashed with SIGSEGV in g_object_unref()gdeskletsMediumTriaged15No
432964System crash in guest session locks /etc/passwd foreveradduserMediumNew15No
432964System crash in guest session locks /etc/passwd forevershadowMediumConfirmed15No
355829alacarte crashed with IOError in on_edit_properties_activate()alacarteMediumTriaged15No
570529package b43-fwcutter 1:012-1build1 failed to install/upgrade: subprocess installed post-installation script returned error exit status 4b43-fwcutterLowConfirmed15No
9068Serial mouse/mice not autodetectedcasperMediumConfirmed15No
545118mission-control-5 crashed with SIGSEGV in g_cclosure_marshal_VOID__VOID()telepathy-mission-control-5MediumNew15No
902698lightdm crashed with SIGSEGV in check_stopped()lightdmHighTriaged15No
197581update-manager crashed with RuntimeError in () : RuntimeError: could not open display.It should display a warning when $DISPLAY is not set.update-managerLowTriaged15No
351469kblueplugd crashed with DistutilsExecError in _spawn_posix()kdebluetoothUndecidedConfirmed15No
867645gnome-shell crashed with SIGABRT in raise()gnome-shellMediumConfirmed15No
326609[MASTER] No flash in firefox after upgrade from intrepid to jauntyubufoxUndecidedConfirmed15No
438366software-center crashed with AttributeError: 'module' object has no attribute 'Element'gst-pythonUndecidedNew15No
634772telepathy-salut assert failure: telepathy-salut: glib-watch.c:203: timeout_free: Assertion `!t->dead' failed.telepathy-salutMediumConfirmed15No
638791old and faulty rt2860sta [The self compiled rt2860sta works.]linuxHighTriaged15No
440498apt_check.py crashed with SIGSEGV in pkgCacheGenerator::ListParser::NewDepends()update-notifierMediumTriaged15No
739746bluetoothd crashed with SIGSEGV in g_main_context_dispatch()bluezMediumConfirmed15No
132636Balazar crashes with soya3d error: invalid GL_ENUMbalazarHighTriaged15No
571038palimpsest crash with libgdu:ERROR:gdu-pool.c:2369:device_recurse: assertion failed: (depth < 100)gnome-disk-utilityHighTriaged15No
640732audacious2 crashed with SIGSEGV in std::ios_base::Init::~Init()gcc-4.4UndecidedNew15No
521431[Master] font package failed to install/upgrade: post-installation exit status 1 - /etc/defoma/hints/ttf-dejavu-extra.hints: Unable to open, or emptydefomaUndecidedTriaged15No
261138[MainMenu] MainMenuScreenlet.py crashed with IOError in __save_cache()screenletsMediumConfirmed15No
812476gvfsd-trash crashed with signal 5 in _g_dbus_oom()gvfsMediumTriaged15No
709461Application windows can sometimes fail to display and will mask regions of the screenunityMediumTriaged15No
709461Application windows can sometimes fail to display and will mask regions of the screencompizMediumTriaged15No
29894can't take screenshot when menu on panel is openedunityLowTriaged15No
29894can't take screenshot when menu on panel is openedgnome-utilsLowTriaged15No
221939internet_test crashed with UnboundLocalError in _get_default_gateway_from_bin_route()hwtestUndecidedConfirmed15No
844003xchat-gnome crashed with SIGSEGV in gtk_clipboard_set_contents()xchat-gnomeMediumTriaged15No
181731National translations of "df" output misalignedcoreutilsUndecidedConfirmed15No
912909gimp-2.6 crashed with SIGSEGVgimpMediumConfirmed15No
263187update-apt-xapian-index crashed with OSError in ()apt-xapian-indexUndecidedConfirmed15No
77010Overuse of system beep without volume controlpulseaudioMediumConfirmed15No
262440package freeciv-client-gtk 2.1.5-1 failed to install/upgrade (with error exit status 255)freecivHighConfirmed14No
764119nautilus crashed with SIGSEGV in g_type_instance_get_private()braseroMediumTriaged14No
277902update-manager crashed with TypeError in _get_last_apt_get_update_text()language-support-arUndecidedNew14No
12154Nautilus should have a superuser modenautilusWishlistTriaged14No
724680update-manager assert failure: python2.7: ../../src/xcb_io.c:221: poll_for_event: Zusicherung »(((long) (event_sequence) - (long) (dpy->request)) <= 0)« nicht erfüllt.update-managerMediumConfirmed14No
973096Nvidia driver causes xorg crashnvidia-graphics-driversHighConfirmed14No
447209xfce4-volumed crashed with SIGFPE in __libc_start_main()xfce4-volumedMediumConfirmed14No
184711network-admin error: The interface does not existgnome-system-toolsLowTriaged14No
932549aptd crashed with DBusException in call_blocking(): org.freedesktop.DBus.Error.AccessDenied: Connection ":1.76" is not allowed to own the service "org.freedesktop.PackageKit" due to security policies in the configuration fileaptdaemonHighConfirmed14No
741035gwibber-service crashed with OperationalError in maintenance(): database is lockedgwibberMediumConfirmed14No
743497gvfsd-sftp crashed with SIGABRT in raise()libgnome-keyringMediumConfirmed14No
219385File filters can make file selection dialog too wide for screengtk+2.0LowConfirmed14No
40872Desktop icons are allowed to overlapnautilusLowTriaged14No
933776[regression] "Initiate Window Picker for All Windows" does not show all windows. It shows only windows from curent workspace.compizMediumTriaged14No
563554desktopcouch-service crashed with ServerError in _request()desktopcouchMediumConfirmed14No
272642jockey-gtk crashed with DBusException in call_blocking() (timeout in backend.detect() )jockeyMediumTriaged14No
733382package openswan-modules-dkms 1:2.6.28 dfsg-5 failed to buildopenswanUndecidedConfirmed14No
634247package openvas-server 2.0.3-3 failed to install/upgrade: subprocess installed post-installation script returned error exit status 10openvas-serverUndecidedConfirmed14No
274116ccsm crashed with TypeError in ImportProfileAs()compizconfig-settings-managerMediumTriaged14No
322433linux-backports-modules-2.6.28-4-generic purge failsinitramfs-toolsUndecidedNew14No
178038npviewer.bin crashed with SIGSEGV nspluginwrapperMediumTriaged14No
264469devilspie crashed with SIGSEGVdevilspieMediumNew14No
500069USB file transfer causes system freezes; ops take hours instead of minuteslinuxHighTriaged14No
322433linux-backports-modules-2.6.28-4-generic purge failslinux-backports-modules-2.6.28MediumTriaged14No
609921plymouthd assert failure: plymouthd: ./plugin.c:697: open_input_source: Assertion `backend != ((void *)0)' failed.plymouthMediumConfirmed14No
85031[apport] apt-listchanges crashed with IOError in mail_changes()apt-listchangesMediumTriaged14No
870593upowerd crashed with SIGSEGV in node_list_remove()upowerMediumTriaged14No
812904update-manager crashed with AuthorizationFailed in _run(): org.freedesktop.PolicyKit.Error.Failed: ('system-bus-name', {'name': ':1.47'}): org.debian.apt.update-cacheupdate-managerUndecidedConfirmed14No
805717package libnunit2.4-cil 2.4.7+dfsg-6 failed to install/upgrade: subprocess installed post-installation script returned error exit status 9nunitUndecidedConfirmed14No
286175evince crashed with SIGSEGV in FcConfigSubstituteWithPat()fontconfigHighConfirmed14No
418242Incorrect call to output plugins (with persistent error message) on copyinkscapeMediumTriaged14No
286175evince crashed with SIGSEGV in FcConfigSubstituteWithPat()cairoHighConfirmed14No
863454Banshee.exe crashed with SIGABRT in ()bansheeMediumConfirmed14No
746761can't type characters with accent (dead keys)nuxWishlistConfirmed14No
680968nautilus crashed with SIGSEGV in g_str_hash() [ubuntuone_nautilus_observed_file_unref]ubuntuone-clientHighTriaged14No
278521hpijs crashed with SIGSEGVhplipMediumConfirmed14No
256190audio_playback crashed with signal 5 in g_object_unref()hwtestUndecidedConfirmed14No
124468debsecan crashed with IOError in write()debsecanMediumTriaged14No
623624check-new-release crashed with IOError in print_usage()update-managerUndecidedConfirmed14No
83974webbrowser incorrectly handles quoted arguments for GNOME browser configurationpython2.5MediumConfirmed14No
626775install.py crashed with AssertionError in __init__()ubiquityUndecidedConfirmed14No
123920Bluetooth Logitech Dinovo Keyboard/Mouse don't workbluezMediumTriaged13No
326367gtk-window-decorator crashed with SIGSEGV in set_item_text()compizMediumTriaged13No
656519Alt+Space window accessibility menu should not be accessible by right clicking on a window title barcompizUndecidedConfirmed13No
798459package nspluginwrapper 1.2.2-0ubuntu9 failed to install/upgrade: sub-processo script post-installation instalado retornou estado de saída de erro 134nspluginwrapperHighConfirmed13No
880079bluetooth-applet crashes when trying to browse devicegnome-bluetoothHighIn Progress13No
939573ktp-contactlist crashed with SIGSEGV in QCoreApplication::removePostedEvents()ktp-contact-listHighConfirmed13No
656519Alt+Space window accessibility menu should not be accessible by right clicking on a window title barunity-2dLowConfirmed13No
656519Alt+Space window accessibility menu should not be accessible by right clicking on a window title barunityLowConfirmed13No
566379[i855] X doesn't start with kernel 2.6.32-21 unless passing i915.modeset=1linuxHighTriaged13No
661070usb-creator-gtk assert failure: *** glibc detected *** /usr/bin/python: free(): invalid pointer: 0x0a0074f0 ***usb-creatorMediumConfirmed13No
632157update-apt-xapian-index crashed with DatabaseCorruptError in updateIndex()apt-xapian-indexUndecidedConfirmed13No
831491gm-notify crashed with GError in labelClick(): Configuration server couldn't be contacted: D-BUS error: Method "LookupExtended" with signature "ssb" on interface "org.gnome.GConf.Database" doesn't existgm-notifyMediumConfirmed13No
351806Unable to install desktop 9.04jockeyUndecidedConfirmed13No
410909hardinfo crashed with SIGSEGV in fft_bench_start()hardinfoMediumConfirmed13No
318791computertemp crashes when no sensors are configuredcomputertempMediumTriaged13No
50150make schemas registration use error logginggconf2HighConfirmed13No
284915Khelpcenter missing docs listkde-runtimeLowConfirmed13No
903696bzr-notify crashed with SIGSEGV in g_return_if_fail_warning()bzr-gtkMediumConfirmed13No
317330[Master] No sound in flashfirefox-3.5MediumIn Progress13No
408541glxinfo crashed with SIGSEGV in memset()nvidia-graphics-drivers-180HighTriaged13No
284915Khelpcenter missing docs listkde-workspaceLowConfirmed13No
782165Evolution 2.32.2 in Natty mindlessly uses socks proxy environmentevolutionHighConfirmed13No
745112[arrandale] desktop is messed up with external monitors (x86_64)linuxHighTriaged13No
581045package nvidia-* failed to install/upgrade: nvidia-* kernel module failed to build (FATAL: modpost: GPL-incompatible module nvidia.ko uses GPL-only symbol 'xen_features') [Lucid on kernel 2.6.32-22]nvidia-graphics-driversMediumTriaged13No
284915Khelpcenter missing docs listamarokUndecidedConfirmed13No
284915Khelpcenter missing docs listkdepimlibsLowConfirmed13No
794745package nvidia-173 173.14.22-0ubuntu11 failed to install/upgrade with newer kernels: subprocess installed post-installation script returned error exit status 10 [Lucid]nvidia-graphics-drivers-173HighTriaged13No
276836apertium-tolk crashed with TypeError in on_comboPair_changed()apertium-tolkMediumConfirmed13No
284915Khelpcenter missing docs listadeptLowTriaged13No
439356gnome-screensaver-gl-helper crashed with SIGSEGV in exit()nvidia-graphics-drivers-180HighTriaged13No
918551touchegg crashed with SIGSEGV in geis_get_region_attr_type()toucheggMediumConfirmed13No
284915Khelpcenter missing docs listkdemultimediaLowConfirmed13No
284915Khelpcenter missing docs listktorrentLowTriaged13No
818516gnome-system-log assert failure: *** glibc detected *** gnome-system-log: free(): invalid next size (fast): 0x08e2c2a0 ***gnome-utilsMediumConfirmed13No
172416eog determines image type from filenameeogLowTriaged13No
284915Khelpcenter missing docs listkdenetworkLowConfirmed13No
284915Khelpcenter missing docs listdigikamLowConfirmed13No
911706USC relies on NM to be online, can't force online if not using NMsoftware-centerMediumConfirmed13No
741395unity-window-decorator crashed with SIGSEGV in g_slice_alloc()compizMediumConfirmed13No
340705IOError: [Errno 21] Is a directory in File "/usr/sbin/update-gconf-defaults", line 118, in read_entries(realname)gconfMediumTriaged13No
555274mission-control-5 crashed with SIGSEGV in g_closure_invoke()telepathy-mission-control-5MediumConfirmed13No
356188alacarte crashed with ExpatError in parseFile()alacarteMediumTriaged13No
863773gedit crashed with SIGSEGV in __memcpy_ssse3() (when using snippet)pygobjectHighTriaged13No
573590package rtkit 0.6-0ubuntu1 failed to install/upgrade: rtkitUndecidedConfirmed13No
898851update-manager crashed with TypeError in function(): Must be number, not tupleaptdaemonHighTriaged13No
461584package openerp-server 5.0.5-1 failed to upgrade due to a missing group; chown: invalid group: `openerp:openerp'openerp-serverMediumTriaged13No
238542[Master] Firefox crash when organizing bookmark menufirefox-3.0UndecidedConfirmed13No
745101gconftool-2 crashed with SIGABRT in raise()gconfMediumConfirmed13No
790372package bind9 failed to install/upgrade: subprocess installed post-installation script returned error exit status 1bind9UndecidedConfirmed13No
930823software-center crashed with SIGABRT in __assert_fail_base()software-centerMediumConfirmed13No
923137systray.py crashed with SIGSEGV in do_warn()hplipMediumConfirmed13No
283541failed to initialise when repositories have broken informationaptLowTriaged13No
581045package nvidia-* failed to install/upgrade: nvidia-* kernel module failed to build (FATAL: modpost: GPL-incompatible module nvidia.ko uses GPL-only symbol 'xen_features') [Lucid on kernel 2.6.32-22]nvidia-graphics-drivers-173MediumTriaged13No
923410HUD - closing a window with + opens the hudunity-2dHighTriaged13No
131314hwdb-gui crashed with UnboundLocalError in get_xorgdata()hwdb-clientUndecidedConfirmed13No
958212unity_support_test crashed with SIGSEGV in xcb_glx_query_server_string_string_length()nuxHighConfirmed13No
317330[Master] No sound in flashfirefox-3.0MediumIn Progress13No
282323Firefox flash problems (npviewer.bin crashed with SIGSEGV [with attached backtrace])nspluginwrapperMediumConfirmed13No
520118thunar select freezes after using mouse to select folders ("detailed view" mode)gtk+2.0LowTriaged13No
622293package libndesk-dbus-glib1.0-cil 0.4.1-3 failed to install/upgrade:ndesk-dbus-glibUndecidedNew13No
590296package ocsinventory-server 1.02.1-2 failed to install/upgrade: subprocess installed post-installation script returned error exit status 1ocsinventory-serverUndecidedConfirmed13No
973491nautilus popup menu highlighting using copy and paste incorrect (items displayed unactive when they are not)gtk+3.0HighTriaged13No
149076I can't write a cdcdrkitUndecidedConfirmed13No
717645software-center crashed with ValueError in __init__(): Need either appname or pkgname or requestsoftware-centerMediumConfirmed13No
150690Can't drag a window to another workspacelibwnckWishlistTriaged12No
240738syndaemon sometimes fails to disable the touchpadxserver-xorg-input-synapticsLowConfirmed12No
797517package gconf2 2.32.2-0ubuntu2 failed to install/upgrade: subprocess installed post-installation script returned error exit status 1gconfUndecidedConfirmed12No
346930fusion-icon - settings manager crashescompizconfig-settings-managerUndecidedNew12No
626382Shotwell should be mentioned instead of F-Spotubuntu-docsMediumIn Progress12No
153868package mysql-server failed to install/upgrade - Access denied for user 'debian-sys-maint'@'localhost'mysql-dfsg-5.1MediumTriaged12No
520824update-app-install crashed with UnicodeEncodeError in __eq__()gnome-app-installMediumTriaged12No
187919alacarte crashed with AttributeError in split()alacarteMediumTriaged12No
466575secure remove of external USB-HDD produces errorudisksLowConfirmed12No
931353package linux-tools-common (not installed) failed to install/upgrade: trying to overwrite '/usr/bin/perf', which is also in package linux-base 3.3linux-baseHighIn Progress12No
349350alacarte crashed with IOError in __addUndo()alacarteMediumTriaged12No
839219synaptic crashes immediately on startup with SIGABRT in raise() [Only when accessibility is enabled, e.g. screen reader]synapticMediumConfirmed12No
706328package openoffice.org-writer2xhtml 1.0-10ubuntu1 failed to install/upgrade: subprocess installed post-installation script returned error exit status 1writer2latexUndecidedConfirmed12No
849654gwibber-service crashed with IOError in get_avatar_path(): [Errno 36] File name too long: u'/home/samael/.cache/gwibber/avatars//.'gwibberMediumTriaged12No
743638compiz crashed with SIGABRT in raise()compizMediumConfirmed12No
435508mission-control-5 assert failure: mcd:ERROR:mcd-dispatcher.c:2350:handler_get_all_cb: assertion failed: (unique_name != NULL)telepathy-mission-control-5MediumNew12No
868188"Internal Error ...google-chrome-stable_current_amd64.deb could not be opened"software-centerMediumIn Progress12No
546578black screen after a few user switcheslinuxMediumConfirmed12No
681938It is possible to click on AppMenu menus when in workspace switcher, but they don't showunityLowTriaged12No
34199Evolution cannot connect to Exchange backend processevolution-exchangeHighConfirmed12No
695713installer crashed in InstallStepError: Plugin usersetup failed with code 32ubiquityLowConfirmed12No
576528auto-install-tester can not install/remove this package: trying to overwrite '/usr/bin/my_print_defaults', which is also in package mysql-server-core-5.1 0:5.1.41-3ubuntu12mysql-cluster-7.0HighIn Progress12No
465230Need better error handling for timestamp failuresubuntuone-clientHighTriaged12No
804033package virtualbox-ose-dkms (not installed) failed to install/upgrade: subprocess new pre-installation script returned error exit status 5virtualbox-oseHighConfirmed12No
810255[MASTER] update-manager crashed with UnicodeEncodeError in get_dbus_message(): 'ascii' codec can't encode character u'\xfc' in position 56: ordinal not in range(128)dbus-pythonUndecidedConfirmed12No
917727systray.py crashed with SIGSEGV in do_warn.29064()hplipMediumConfirmed12No
84060[7.04] alacarte crashed with AttributeError in __getPath()alacarteMediumTriaged12No
433654Only one user gets sound with privilege "Use audio devices"consolekitMediumTriaged12No
433654Only one user gets sound with privilege "Use audio devices"gnome-system-toolsMediumTriaged12No
327872Broken support for MPEG-TS: HDV and AVCHD (.mts/.m2ts) filesshared-mime-infoUndecidedConfirmed12No
929064nautilus crashed with SIGSEGV in set_floating_bar_status()nautilusHighTriaged12No
269909gadmin-proftpd crashed with SIGSEGV in g_type_check_instance_cast()gadmin-proftpdMediumConfirmed12No
6290DV capture over Firewire is broken (no rights for /dev/raw1394)kinoLowTriaged12No
500175Canceling an installation in Software Center crashes debconf with "Use of uninitialized value $reply in scalar chomp at /usr/share/perl5/Debconf/FrontEnd/Passthrough.pm line 66,"aptdaemonLowConfirmed12No
500175Canceling an installation in Software Center crashes debconf with "Use of uninitialized value $reply in scalar chomp at /usr/share/perl5/Debconf/FrontEnd/Passthrough.pm line 66,"software-centerUndecidedConfirmed12No
500175Canceling an installation in Software Center crashes debconf with "Use of uninitialized value $reply in scalar chomp at /usr/share/perl5/Debconf/FrontEnd/Passthrough.pm line 66,"debconfUndecidedConfirmed12No
93847Excessive CPU usage by Gnome System Monitor gnome-system-monitorLowTriaged12No
947955package dictionaries-common 1.12.1ubuntu2 failed to install/upgrade: ErrorMessage: subprocess installed post-installation script returned error exit status 255dictionaries-commonUndecidedNew12No
726033does not display icons until hoveredmesaLowTriaged12No
318465Logitech MX5000 doesn't connect via bluetooth under ubuntubluezLowConfirmed12No
546492usbmuxd failed to upgrade: chfn: PAM authentication failedusbmuxdMediumConfirmed12No
750608Banshee.exe crashed with SIGABRT in raise()bansheeMediumConfirmed12No
638195nautilus crashed with SIGSEGV in free()nautilus-shareMediumConfirmed12No
285682can't mount digital camera showing a window popup message: -60 could not lock the device messagegvfsMediumConfirmed12No
765438On startup, the backlight is off on laptoplinuxUndecidedTriaged12No
413737BadAccess (attempt to access private resource denied)firefox-3.5MediumNew12No
450662DBusException: org.freedesktop.DBus.Error.AccessDenied: Connection ":1.63" is not allowed to own the service "org.debian.apt" due to security policies in the configuration fileaptdaemonMediumConfirmed12No
608124Dash - Implement *overlay scrollbars* in DashunityMediumTriaged12No
608124Dash - Implement *overlay scrollbars* in Dashunity-2dMediumTriaged12No
627195Window management - Apps raised from indicators sometimes dont have the focusunityHighTriaged12No
896689: 'NoneType' object has no attribute 'version'aptHighConfirmed12No
627195Window management - Apps raised from indicators sometimes dont have the focuscompizHighTriaged12No
882147overlayfs does not implement inotify interfaces correctlylinuxHighTriaged12No
64594hurestore will always crash on startup (unfinished tool)hubackupHighConfirmed12No
908377kwin_opengl_test crashed with SIGSEGV in i915_set_draw_region()xserver-xorg-video-intelMediumConfirmed12No
647500update-apt-xapian-index crashed with ValueError in setupIndexing()apt-xapian-indexUndecidedConfirmed12No
940093'/usr/share/app-install/desktop/kde-telepathy-send-file:kde4__ktp-send-file.desktop' could not be read correctlyktp-send-fileUndecidedConfirmed12No
343870php-cli segmentation fault with mysql extensionmysql-dfsg-5.0MediumConfirmed12No
772986Unity launcher single missing/invisible/blank iconunityHighConfirmed12No
247387package memtest86+ 1.70-3ubuntu1 failed to install/upgrade: memtest86+UndecidedConfirmed12No
447080cron crashed with SIGSEGV in _init()cronMediumTriaged12No
156085Could not open /proc/bus/usb/devicesusbviewMediumTriaged12No
405982package language-pack-gnome-pl-base 1:9.04+20090413 failed to install/upgrade: próba nadpisania "/usr/share/locale-langpack/pl/LC_MESSAGES/subversion.mo", który istnieje także w pakiecie language-pack-pl-baselanguage-pack-gnome-pl-baseUndecidedNew12No
993427fglrx 2:8.960-0ubuntu1: fglrx kernel module failed to build [error: ‘cpu_possible_map’ undeclared (first use in this function)]fglrx-installerHighTriaged12No
368857package acpid 1.0.6-9ubuntu4.9.04.2 failed to install/upgrade: subprocess post-installation script returned error exit status 1acpidUndecidedNew12No
851843gedit crashed with SIGABRT in g_assertion_message(): (r == n_visible_rows)gtk+3.0HighTriaged12No
718977brcupsconfpt1 assert failure: *** buffer overflow detected ***: /usr/Brother/Printer/mfc440cn/cupswrapper/brcupsconfpt1 terminatedbrother-cups-wrapper-commonMediumConfirmed12No
260775apt-check crashed with signal 7 in debPackagesIndex::FindInCache()update-notifierMediumConfirmed12No
841366jockey-backend crashed with TypeError in pulse_items(): an integer is requiredpython-aptMediumTriaged12No
829861empathy-chat crashed with SIGSEGV in _tp_base_client_handle_channels()telepathy-glibMediumTriaged12No
464902telepathy-butterfly crashed with NotImplementedError in _on_error()telepathy-butterflyMediumNew12No
405544Kernel does not recognize blank optical mediabraseroMediumTriaged12No
707508telepathy-butterfly crashed with KeyError in add_to_connection(): "Can't register the object-path handler for '/org/freedesktop/Telepathy/Connection/butterfly/msn/dillenmijboom_40hotmail_2ecom/RosterChannel/List/subscribe': there is already a handler"telepathy-butterflyMediumTriaged12No
752214gconftool-2 crashed with SIGABRT connection->initialization_error == NULL()gconfMediumNew11No
540351gwibber crashed on startup with ServerError in _request()desktopcouchMediumTriaged11No
437139metacity assert failure: metacity:ERROR:core/boxes.c:1161:meta_rectangle_edge_aligns: code should not be reachedmetacityMediumTriaged11No
68924provide support for changing volume labelsnautilusWishlistTriaged11No
528172desktopcouch-service crashed with IOError in __init__()desktopcouchUndecidedConfirmed11No
755600: [Errno 9] Bad file descriptoraptdaemonMediumTriaged11No
617095nautilus-scripts-manager crashed with IOError in retrieve_default_path()nautilus-scripts-managerUndecidedConfirmed11No
799001gnome-panel crashed with SIGSEGV in gtk_widget_pop_verify_invariants()gnome-panelMediumTriaged11No
479335synaptic crashed with SIGSEGV in g_cclosure_marshal_VOID__VOID()synapticMediumConfirmed11No
194894[MASTER] Firefox reports Gecko Engine Version in "about:"firefox-3.5LowTriaged11No
508120every program i download,does never open or work always archive manager have a problem.i cant open my download programsfile-rollerUndecidedIn Progress11No
403762ubiquity crashed with GError in __init__()ubiquityUndecidedConfirmed11No
732307modem-manager crashed with SIGSEGV in mm_modem_icera_cleanup()modemmanagerMediumConfirmed11No
855767pcmanfm crashed with SIGSEGV in g_closure_invoke()pcmanfmMediumConfirmed11No
607229battery.py crashed with DBusException in call_blocking()awn-extrasMediumTriaged11No
741653[i965gm] GPU lockup (EIR: 0x00000010 ESR: 0x00000010 PGTBL_ER: 0x00000100)udevUndecidedConfirmed11No
379470sunbird-bin crashed with SIGSEGV in strcmp()lightning-sunbirdMediumConfirmed11No
198242synergyc crashed with SIGSEGV in std::_Rb_tree_increment()synergyMediumConfirmed11No
860045package gdb-msp430 7.2~mspgcc-7.2-20110612-1 failed to install/upgrade: trying to overwrite '/usr/share/gdb/python/gdb/__init__.py', which is also in package gdb 7.3-0ubuntu2gdb-msp430UndecidedConfirmed11No
631428Empathy doesn't apply avatar for MSNpapyonLowTriaged11No
411073gclcvs segfaults during clc initializationgclcvsHighTriaged11No
662077WxWidgets apps don't have menuswxwidgets2.6UndecidedConfirmed11No
913041Thunar crashed with SIGSEGV in fast_validate()thunarMediumTriaged11No
835885indicator-session-service crashed with SIGABRT in raise()indicator-sessionMediumConfirmed11No
410432QDragManger crashes in various applicationsqt4-x11MediumTriaged11No
942106software raid doesn't assemble before mount on bootmdadmHighConfirmed11No
926548add-apt-repository fails with gnutls_handshake errorpycurlMediumTriaged11No
599931rhythmbox crashed with SIGSEGV in g_closure_invoke()rhythmboxMediumTriaged11No
725835desktopcouch-service crashed with RuntimeError in direct_access_find_port(): Unable to find listening portdesktopcouchUndecidedConfirmed11No
968759adobe-flashplugin 11.2.202.228-0lucid1freezes firefox display - crashes some webkit programs (depends on cpu)adobe-flashpluginUndecidedConfirmed11No
968759adobe-flashplugin 11.2.202.228-0lucid1freezes firefox display - crashes some webkit programs (depends on cpu)flashplugin-nonfreeUndecidedConfirmed11No
450951telepathy-butterfly crashed with KeyError in __getitem__()telepathy-butterflyLowTriaged11No
18125hwdb raises Exception when looking up routehwdb-clientMediumConfirmed11No
319916drv crashed with SIGSEGVcupsddkMediumNew11No
445154package backuppc 3.1.0-4ubuntu1.1 failed to install/upgrade: subprocess post-installation script returned error exit status 1backuppcLowConfirmed11No
967091Wrong tint in flash when it uses video accelerationadobe-flashpluginUndecidedConfirmed11No
108601Update-manager needs help info when terminating on wrong repositories and generally deal better with incorrect sources.list dataupdate-managerWishlistConfirmed11No
342049toolbox.py crashed with ImportError in ()hplipUndecidedNew11No
308605[MASTER]Firefox is already running messagefirefox-3.0MediumTriaged11No
308605[MASTER]Firefox is already running messagefirefox-3.5MediumTriaged11No
185588evolution-data-server-2.22 crashed with signal 5evolution-data-serverMediumTriaged11No
814473gnome-settings-daemon crashed with SIGSEGV in gdk_display_get_event()gnome-settings-daemonMediumTriaged11No
447459nautilus crashed with SIGSEGV in g_type_check_instance()nautilusMediumTriaged11No
571190check-new-release crashed with IOError in print_usage()update-managerLowConfirmed11No
650869update-apt-xapian-index crashed with NameError in slave()apt-xapian-indexUndecidedConfirmed11No
819234update-manager crashed with NotAuthorizedError in _run(): org.freedesktop.PolicyKit.Error.NotAuthorized: ('system-bus-name', {'name': ':1.60'}): org.debian.apt.install-or-remove-packagesupdate-managerMediumTriaged11No
215795pycentral crashed with IOError in read_pyfiles()python-centralUndecidedConfirmed11No
839828gvfsd-http crashed with SIGSEGV in g_settings_get_child()gvfsHighTriaged11No
855556"Restart" and "Shut Down" don't work if anyone else is logged inindicator-sessionHighConfirmed11No
855556"Restart" and "Shut Down" don't work if anyone else is logged ingnome-sessionHighConfirmed11No
576919package fglrx 2:8.723.1-0ubuntu3 failed to install/upgrade: fglrx kernel module failed to build.'getpwuid(): uid not found: 130154438' - ‘KCL_ConvertPageToKernelAddress’ makes pointer from integerfglrx-installerHighConfirmed11No
192629"Cannot move file to trash, do you want to delete immediately?" on NTFS / VFAT partitionsglib2.0LowTriaged11No
645818Unknown keyword in configuration file: gfxbootusb-creatorHighConfirmed11No
855123at-spi2-registryd crashed with signal 5 in g_type_create_instance()at-spi2-coreMediumTriaged11No
342868grnotify crashed with ImportError in ()grnotifyMediumConfirmed11No
94893[apport] rhythmbox crashed with SIGSEGV in gnome_vfs_context_get_cancellation()gnome-vfs2MediumTriaged11No
147312ccsm crashed with KeyError in UpdateEnabledPluginsList()compizconfig-settings-managerUndecidedConfirmed11No
206050[NowPlaying] screenlets writing to stdout results in "broken pipe"screenletsMediumTriaged11No
234914papercut crashed with IOError in write_pid()papercutUndecidedNew11No
819809gnome-session-check-accelerated-helper crashed with SIGSEGV in XF86DRIQueryVersion()fglrx-installerLowConfirmed11No
707392Not possible to upgrade untrusted packagesupdate-managerLowTriaged11No
861533ecb package will not install on oneiricecbUndecidedConfirmed11No
870767rhythmbox-metadata crashed with SIGSEGV in gst_structure_copy()rhythmboxMediumTriaged11No
183421evolution-data-server-2.22 crashed with signal 5 in g_mutex_free_posix_impl()evolution-data-serverMediumTriaged11No
789030package cacti 0.8.7e-2ubuntu0.1 failed to install/upgrade: subprocess installed pre-removal script returned error exit status 1dbconfig-commonUndecidedConfirmed11No
816808mission-control-5 crashed with SIGABRT in raise()telepathy-mission-control-5MediumTriaged11No
732677bcmwl 5.100.82.38+bdcom-0ubuntu2 not work on BCM4311/4312bcmwlHighConfirmed11No
50041System lock on upgrade or new installwvdialHighTriaged11No
448436ggl-gtk crashed with SIGSEGVgoogle-gadgetsMediumConfirmed11No
92352[apport] cyclone crashed with SIGSEGV in __libc_start_main()rss-glxMediumConfirmed11No
689306package python2.7-minimal 2.7.1-1ubuntu1 failed to install/upgrade: ErrorMessage: subprocess installed post-installation script returned error exit status 3python2.7MediumConfirmed11No
525734WARNING: at /build/buildd/linux-2.6.32/net/mac80211/scan.c:288 ieee80211_scan_completed+0x290/0x2a0 [mac80211]()linuxLowConfirmed10No
316514MASTER: Xinerama/Multihead with multiple video cards is not supported for most video driversxorg-serverWishlistTriaged10No
960204BUG: unable to handle kernel paging request at ffff8800df86ded0linuxMediumTriaged10No
775377grub-mount assert failure: *** glibc detected *** grub-mount: free(): invalid next size (fast): 0x08d25b98 ***grub2MediumConfirmed10No
930575compiz crashed with SIGSEGV in g_type_check_instance() from g_signal_emit_valist() from g_signal_emit() from bamf_matcher_on_view_closed() from bamf_marshal_VOID__STRING_STRING()compizMediumTriaged10No
829286software-properties-gtk crashed with ValueError in run(): is not in listsoftware-propertiesUndecidedConfirmed10No
212184telepathy-butterfly crashed with AttributeError in _on_blob_received()pymsnMediumTriaged10No
813139indicator-session-service crashed with signal 5 in g_type_create_instance()indicator-sessionMediumConfirmed10No
27064Nautilus location bar disappearsnautilusLowTriaged10No
240930nspluginviewer comsumes allmoust all CPUnspluginwrapperUndecidedConfirmed10No
715411update-apt-xapian-index crashed with DatabaseLockError in __init__(): Unable to get write lock on /var/cache/apt-xapian-index/index.2: already lockedapt-xapian-indexUndecidedConfirmed10No
744812FontConfig/Qt stack choke on Ubuntu Medium font meta-data (No medium in Inkscape and too bold in Qt apps)fontconfigUndecidedConfirmed10No
614166upgrade procedure: karmic --> luciddeskbar-appletLowNew10No
751725software-center crashed with AptDaemonError in _medium_required(): org.debian.apt: Could not cancel transactionsoftware-centerUndecidedConfirmed10No
240930nspluginviewer comsumes allmoust all CPUflashplugin-nonfreeUndecidedConfirmed10No
251709rdesktop works bad with several keyboard layoutsrdesktopUndecidedConfirmed10No
860970Dash called with super key above fullscreen app is displayed, but click-throughunityHighConfirmed10No
369274SIGSEGV in _nss_wins_gethostbyname_rglibcUndecidedConfirmed10No
525471aptitude crashed with SIGSEGV in pkgAcquire::Worker::RunMessages()aptitudeMediumNew10No
109156Resizing a nautlius window casues _NET_WM_MOVERESIZE window manager warningsmetacityLowTriaged10No
927501synaptic crashed with SIGSEGV in RGWindow::windowCloseCallback()synapticMediumConfirmed10No
807726xfstt assert failure: *** stack smashing detected ***: /usr/bin/xfstt terminatedxfsttMediumConfirmed10No
824684software-properties-gtk crashed with DBusException in call_blocking(): com.ubuntu.SoftwareProperties.PermissionDeniedByPolicy: com.ubuntu.softwareproperties.applychangessoftware-propertiesMediumConfirmed10No
953368gtk-window-decorator crashed with SIGSEGV in update_event_windows()compizMediumConfirmed10No
828922failed to upgrade to oneiric: /usr/bin/perl: symbol lookup error: /usr/lib/gio/modules/libgiobamf.so: undefined symbol: g_desktop_app_info_launch_handler_get_typebamfUndecidedConfirmed10No
479656Crash during boot in __kernel_vsyscall ()nvidia-graphics-drivers-180HighTriaged10No
645883twistd crashed with IndexError in __update_cb()nannyUndecidedConfirmed10No
738241gvfs-gdu-volume-monitor crashed with SIGABRT in __kernel_vsyscall()gnome-disk-utilityMediumConfirmed10No
395476nvidia sets HUE to -1000totemLowTriaged10No
860970Dash called with super key above fullscreen app is displayed, but click-throughcompizHighConfirmed10No
836250[Oneiric] [Regression] Intel Corporation Centrino Ultimate-N 6300 poor networking, packet loss and very slow Lenovo X201 and T500 laptopslinuxHighTriaged10No
779300telepathy-butterfly crashed with AssertionError in send_message()telepathy-butterflyMediumTriaged10No
734490networkmanager docklet doesn't work with NetworkManager-0.8.4dockyUndecidedConfirmed10No
743176Pink layer on taken screenshots (gnome-screenshot)compizLowConfirmed10No
964525gnome-control-center crashed with SIGABRT (_XAllocID) (libx11 issue?)gnome-control-centerHighConfirmed10No
809638samba_dnsupdate crashed with RuntimeError in get_credentials(): kinit for INTEL$@REALM failed (Cannot contact any KDC for requested realm)samba4MediumTriaged10No
604809upowerd crashed with SIGSEGV in idevice_get_uuid()upowerMediumConfirmed10No
776499gvim gets no global menu, timeout warning on the consolevimUndecidedConfirmed10No
257639E: The package cache file is corrupted E: _cache->open() failed, please report.update-managerMediumTriaged10No
828679colord crashed with SIGABRT in __kernel_vsyscall()colordMediumConfirmed10No
828196jockey-text crashed with ValueError in __get_value_from_name(): invalid literal for int() with base 10: '173-updates'nvidia-commonUndecidedConfirmed10No
799007nautilus crashed with SIGSEGV in gtk_icon_info_load_symbolic()nautilusMediumTriaged10No
475666python-wxversion failed to upgrade from 9.04 to 9.10 with "file does not exist: /usr/lib/python2.6/dist-packages/wx-2.8-gtk2-unicode/wxversion.py"wxwidgets2.8UndecidedConfirmed10No
228510kubuntu - Upgrade Tool Crashed: CacheExceptionDpkgInterruptedupdate-managerMediumConfirmed10No
195698Password asked separately for each tab that requires it (proxy)firefox-3.5LowTriaged10No
171579Make inkscape remember dialogs window statusinkscapeWishlistTriaged10No
104059MASTER [apport] powertweakd crashed with SIGSEGV in strlen()powertweakMediumConfirmed10No
878492Keyboard shortcut - F10 shortcut is used to show menu and this is wrongunityMediumTriaged10No
555342ubuntuone-preferences crashed with IOError in get_access_token()ubuntuone-clientUndecidedNew10No
878492Keyboard shortcut - F10 shortcut is used to show menu and this is wronggtk+2.0UndecidedConfirmed10No
878492Keyboard shortcut - F10 shortcut is used to show menu and this is wronggtk+3.0UndecidedConfirmed10No
237553package "cupsys 1.3.2-1ubuntu7.7" failed to install or upgradessl-certMediumConfirmed10No
755842Non-maximized windows which sit on the border of a workspace move when calledcompizMediumTriaged10No
968669Xorg crashed with SIGABRTxorg-serverHighTriaged10No
72633crash to gtk_file_info_get_is_foldergtk+2.0MediumTriaged10No
649572polkit-gnome-authentication-agent-1 crashed with SIGSEGV in gtk_image_get_icon_name()policykit-1-gnomeMediumNew10No
932663kernel upgrade failed on a USB live system created by usb-creatorcasperHighTriaged10No
847379e-calendar-factory crashed with SIGABRT in raise() (emsmdb_transaction)evolution-data-serverMediumConfirmed10No
385344Netbooks- Cheese video recording is laggy at higher video resolutionscheeseLowTriaged10No
894311ruby-rvm's maintainer scripts expect the admin group to existruby-rvmMediumConfirmed10No
256255simple-ccsm crashed with KeyError in EnableReflectionChanged()simple-ccsmUndecidedNew10No